{"text_format":"1","workbook":"xlsx","n_sheets":5,"sheets":["Trading Zone","Dashboard","Goals & Target","Option Writing Plan","Haircut for stocks pledgin"],"not_rendered":{"charts":0,"images":2,"macros":1,"external_links":0,"defined_names":1,"comments":0,"pivot_tables":0},"unopened":[],"bounds":{"document_bytes":16777216,"sheet_cells":100000,"rows_first":2000,"rows_last":500,"rows_between":2000,"halvings":0,"cell_chars":16384,"cell_head_chars":4096},"cells_cut":0,"cells_raw":0,"read":"whole","date_system":"1900"}

{"sheet":"Trading Zone","index":0,"n_rows":502,"n_cols":66,"rows_kept":502,"cut":false,"hidden":false,"merged":[[0,59,0,65],[0,35,0,41],[0,26,0,33],[0,21,0,24],[0,43,0,49],[0,51,0,57],[4,21,4,22],[4,23,4,24],[0,0,0,2],[0,18,0,19],[0,3,0,17]]}
["Designed by:\nAbhijeet Shewale",null,null,null,null,null,null,null,null,null,null,null,null,null,null,null,null,null,"Developed by:\nPankaj Jain",null,null,"GoTrade DarkMode P&L Report",null,null,null,null,"BROKERAGE BREAKDOWN",null,null,null,null,null,null,null,null,"EQUITY HOLDING",null,null,null,null,null,null,null,"EQUITY INTRADAY",null,null,null,null,null,null,null,"FUTURES",null,null,null,null,null,null,null,"OPTIONS"]
["Sr. no","Status","Date","No.s","Instrument","Short/Long","Qty","Buy","Sell/LTP","SL","Target","Remarks","Expected CRR","Trade info","P/L","Brokerage","Net P/L","Day's Brokerage","Day's P/L","Reactions",null,"Brokerage Paid Till Now","Current P/L","Funds in Account","Current Balance",null,"Turnover","Brokerage","STT","ETC","GST","SEBI","Stamp duty","Total",null,"Brokerage","STT","ETC","GST","SEBI","Stamp duty","Total",null,"Brokerage","STT","ETC","GST","SEBI","Stamp duty","Total",null,"Brokerage","STT","ETC","GST","SEBI","Stamp duty","Total",null,"Brokerage","STT","ETC","GST","SEBI","Stamp duty","Total"]
[1,"Start","2021-04-08T02:02:45",1,"BNF-OPT-CE","Short",1,201,300,350,200,null,{"$f":"IF(OR(J3=\"\",K3=\"\"),\"\",IF(F3=\"Long\",  ((K3-H3)/(H3-J3)), ((I3-K3)/(J3-I3)) ))","v":2},{"$f":"IF(OR(I3=\"\",D3=\"\",H3=\"\",G3=\"\",E3=\"\",K3=\"\"),\"\",IF(F3=\"Long\",IF(I3=K3,\"Target Achieved\",IF(I3=J3,\"SL Hit\",IF(I3<J3,\"Extended SL Hit\",IF(I3>K3,\"Target Overachieved\",IF(AND(I3>=H3,I3<K3),\"Early Profit Exit\",\"Early Loss Exit\"))))),IF(H3=K3,\"Target Achieved\",IF(H3=J3,\"SL Hit\",IF(H3>J3,\"Extended SL Hit\",IF(H3<K3,\"Target Overachieved\",IF(AND(H3<=I3,H3>K3),\"Early Profit Exit\",\"Early Loss Exit\")))))))","v":"Early Profit Exit"},{"$f":"IF(AA3=\"\",\"\",IF(OR(I3=\"\",H3=\"\"),0,G3*(I3-H3)))","v":99},{"$f":"IF(AH3=\"\",\"\",AH3)","v":47.53},{"$f":"IF(AA3=\"\",\"\",O3-P3)","v":51.47},{"$f":"IF(C3=\"\",\"\",IF(ISNUMBER(SEARCH(\"Start&End\",B3)),SUM(P3:INDEX(P3:P107,MATCH(TRUE,(B3:B107=\"Start&End\"),0))),SUM(P3:INDEX(P3:P107,MATCH(TRUE,(B3:B107=\"End\"),0)))))","v":{"$error":"#N/A"}},{"$f":"IF(C3=\"\",\"\",IF(ISNUMBER(SEARCH(\"Start&End\",B3)),SUM(Q3:INDEX(Q3:Q107,MATCH(TRUE,(B3:B107=\"Start&End\"),0))),SUM(Q3:INDEX(Q3:Q107,MATCH(TRUE,(B3:B107=\"End\"),0)))))","v":{"$error":"#N/A"}},{"$f":"IF(ISNUMBER(S3),S3,\"\")","v":""},null,{"$f":"SUM(P:P,P2)","v":47.53},{"$f":"SUM(Q:Q,Q2)","v":51.47},{"$f":"SUM(W7:W502)-SUM(Y7:Y502)","v":15000},{"$f":"X3+W3","v":15051.47},null,{"$f":"IF((H3+I3)*G3=0,\"\",(H3+I3)*G3)","v":501},{"$f":"IF(ISNUMBER(SEARCH(\"FUT\",E3)),AZ3,IF(ISNUMBER(SEARCH(\"OPT\",E3)),BH3,IF(ISNUMBER(SEARCH(\"HOLD\",E3)),AJ3,AR3)))","v":40},{"$f":"IF(ISNUMBER(SEARCH(\"HOLD\",E3)),AK3,IF(ISNUMBER(SEARCH(\"INTRA\",E3)),AS3,IF(ISNUMBER(SEARCH(\"FUT\",E3)),BA3,BI3)))","v":0},{"$f":"IF(ISNUMBER(SEARCH(\"HOLD\",E3)),AL3,IF(ISNUMBER(SEARCH(\"INTRA\",E3)),AT3,IF(ISNUMBER(SEARCH(\"FUT\",E3)),BB3,BJ3)))","v":0.27},{"$f":"IF(ISNUMBER(SEARCH(\"HOLD\",E3)),AM3,IF(ISNUMBER(SEARCH(\"INTRA\",E3)),AU3,IF(ISNUMBER(SEARCH(\"FUT\",E3)),BC3,BK3)))","v":7.25},{"$f":"IF(ISNUMBER(SEARCH(\"HOLD\",E3)),AN3,IF(ISNUMBER(SEARCH(\"INTRA\",E3)),AV3,IF(ISNUMBER(SEARCH(\"FUT\",E3)),BD3,BL3)))","v":0},{"$f":"IF(ISNUMBER(SEARCH(\"HOLD\",E3)),AO3,IF(ISNUMBER(SEARCH(\"INTRA\",E3)),AW3,IF(ISNUMBER(SEARCH(\"FUT\",E3)),BE3,BM3)))","v":0.01},{"$f":"IF(AB3&AC3&AD3&AE3&AF3&AG3=\"\",\"\",SUM(AB3:AG3))","v":47.53},null,{"$f":"IF(AA3=\"\",\"\",0)","v":0},{"$f":"IF(AA3=\"\",\"\",ROUND(AA3*0.001,2))","v":0.5},{"$f":"IF(AA3=\"\",\"\",ROUND(AA3*0.0000345,2))","v":0.02},{"$f":"IF(AJ3&AL3=\"\",\"\",ROUND((AJ3+AL3)*0.18,2))","v":0},{"$f":"IF(AA3=\"\",\"\",ROUND((5/10000000)*AA3,2))","v":0},{"$f":"IF(G3&H3=\"\",\"\",ROUND(G3*H3*0.00015,2))","v":0.03},{"$f":"IF(AK3&AL3&AM3&AN3&AO3=\"\",\"\",SUM(AK3:AO3))","v":0.55000000000000004},null,{"$f":"IF(MIN(20,((G3*H3*0.0003)))+MIN(20,((G3*H3*0.0003)))=0,\"\",MIN(20,((G3*H3*0.0003)))+MIN(20,((G3*H3*0.0003))))","v":0.12059999999999998},{"$f":"IF(I3&G3=\"\",\"\",ROUND(I3*G3*0.00025,0))","v":0},{"$f":"IF(AA3=\"\",\"\",ROUND(AA3*0.0000345,2))","v":0.02},{"$f":"IF(AR3&AT3=\"\",\"\",ROUND((AR3+AT3)*0.18,2))","v":0.03},{"$f":"IF(AA3=\"\",\"\",ROUND((5/10000000)*AA3,2))","v":0},{"$f":"IF(G3&H3=\"\",\"\",ROUND(G3*H3*0.00003,2))","v":0.01},{"$f":"IF(AR3&AS3&AT3&AU3&AV3&AW3=\"\",\"\",SUM(AR3:AW3))","v":0.18059999999999998},null,{"$f":"IF(MIN(20,((G3*H3*0.0003)))+MIN(20,((G3*H3*0.0003)))=0,\"\",MIN(20,((G3*H3*0.0003)))+MIN(20,((G3*H3*0.0003))))","v":0.12059999999999998},{"$f":"IF(I3&G3=\"\",\"\",ROUND(I3*G3*0.0001,0))","v":0},{"$f":"IF(AA3=\"\",\"\",ROUND(AA3*0.00002,2))","v":0.01},{"$f":"IF(AZ3&BB3=\"\",\"\",ROUND((AZ3+BB3)*0.18,2))","v":0.02},{"$f":"IF(AA3=\"\",\"\",ROUND((5/10000000)*AA3,2))","v":0},{"$f":"IF(G3&H3=\"\",\"\",ROUND(G3*H3*0.00002,2))","v":0},{"$f":"IF(FAZ3&BA3&BB3&BC3&BD3&BE3=\"\",\"\",SUM(AZ3:BE3))","v":0.15059999999999998},null,{"$f":"IF(AA3=\"\",\"\",40)","v":40},{"$f":"IF(I3&G3=\"\",\"\",ROUND(I3*G3*0.0005,0))","v":0},{"$f":"IF(AA3=\"\",\"\",ROUND(AA3*0.00053,2))","v":0.27},{"$f":"IF(BH3&BJ3=\"\",\"\",ROUND((BH3+BJ3)*0.18,2))","v":7.25},{"$f":"IF(AA3=\"\",\"\",ROUND((5/10000000)*AA3,2))","v":0},{"$f":"IF(G3&H3=\"\",\"\",ROUND(G3*H3*0.00003,2))","v":0.01},{"$f":"IF(BH3&BI3&BJ3&BK3&BL3&BM3=\"\",\"\",SUM(BH3:BM3))","v":47.53}]
[2,null,null,null,null,null,null,null,null,null,null,null,{"$f":"IF(OR(J4=\"\",K4=\"\"),\"\",IF(F4=\"Long\",  ((K4-H4)/(H4-J4)), ((I4-K4)/(J4-I4)) ))","v":""},{"$f":"IF(OR(I4=\"\",D4=\"\",H4=\"\",G4=\"\",E4=\"\",K4=\"\"),\"\",IF(I4=K4,\"Target Achieved\",IF(I4=J4,\"SL Hit\",IF(I4<J4,\"Extended SL Hit\",IF(I4>K4,\"Target Overachieved\",IF(AND(I4>=H4,I4<K4),\"Early Profit Exit\",\"Early Loss Exit\"))))))","v":""},{"$f":"IF(AA4=\"\",\"\",IF(OR(I4=\"\",H4=\"\"),0,G4*(I4-H4)))","v":""},{"$f":"IF(AH4=\"\",\"\",AH4)","v":""},{"$f":"IF(AA4=\"\",\"\",O4-P4)","v":""},{"$f":"IF(C4=\"\",\"\",IF(ISNUMBER(SEARCH(\"Start&End\",B4)),SUM(P4:INDEX(P4:P108,MATCH(TRUE,(B4:B108=\"Start&End\"),0))),SUM(P4:INDEX(P4:P108,MATCH(TRUE,(B4:B108=\"End\"),0)))))","v":""},{"$f":"IF(C4=\"\",\"\",IF(ISNUMBER(SEARCH(\"Start&End\",B4)),SUM(Q4:INDEX(Q4:Q108,MATCH(TRUE,(B4:B108=\"Start&End\"),0))),SUM(Q4:INDEX(Q4:Q108,MATCH(TRUE,(B4:B108=\"End\"),0)))))","v":""},"",null,null,null,null,null,null,"","","","","","","",{"$f":"IF(AB4&AC4&AD4&AE4&AF4&AG4=\"\",\"\",SUM(AB4:AG4))","v":""},null,{"$f":"IF(AA4=\"\",\"\",0)","v":""},{"$f":"IF(AA4=\"\",\"\",ROUND(AA4*0.001,2))","v":""},{"$f":"IF(AA4=\"\",\"\",ROUND(AA4*0.0000345,2))","v":""},{"$f":"IF(AJ4&AL4=\"\",\"\",ROUND((AJ4+AL4)*0.18,2))","v":""},{"$f":"IF(AA4=\"\",\"\",ROUND((5/10000000)*AA4,2))","v":""},"",{"$f":"IF(AK4&AL4&AM4&AN4&AO4=\"\",\"\",SUM(AK4:AO4))","v":""},null,"","",{"$f":"IF(AA4=\"\",\"\",ROUND(AA4*0.0000345,2))","v":""},{"$f":"IF(AR4&AT4=\"\",\"\",ROUND((AR4+AT4)*0.18,2))","v":""},{"$f":"IF(AA4=\"\",\"\",ROUND((5/10000000)*AA4,2))","v":""},"",{"$f":"IF(AR4&AS4&AT4&AU4&AV4&AW4=\"\",\"\",SUM(AR4:AW4))","v":""},null,"","",{"$f":"IF(AA4=\"\",\"\",ROUND(AA4*0.00002,2))","v":""},{"$f":"IF(AZ4&BB4=\"\",\"\",ROUND((AZ4+BB4)*0.18,2))","v":""},{"$f":"IF(AA4=\"\",\"\",ROUND((5/10000000)*AA4,2))","v":""},"",{"$f":"IF(FAZ4&BA4&BB4&BC4&BD4&BE4=\"\",\"\",SUM(AZ4:BE4))","v":""},null,"","","",{"$f":"IF(BH4&BJ4=\"\",\"\",ROUND((BH4+BJ4)*0.18,2))","v":""},"","",{"$f":"IF(BH4&BI4&BJ4&BK4&BL4&BM4=\"\",\"\",SUM(BH4:BM4))","v":""}]
[3,null,null,null,null,null,null,null,null,null,null,null,"","","","","",{"$f":"IF(C5=\"\",\"\",IF(ISNUMBER(SEARCH(\"Start&End\",B5)),SUM(P5:INDEX(P5:P109,MATCH(TRUE,(B5:B109=\"Start&End\"),0))),SUM(P5:INDEX(P5:P109,MATCH(TRUE,(B5:B109=\"End\"),0)))))","v":""},{"$f":"IF(C5=\"\",\"\",IF(ISNUMBER(SEARCH(\"Start&End\",B5)),SUM(Q5:INDEX(Q5:Q109,MATCH(TRUE,(B5:B109=\"Start&End\"),0))),SUM(Q5:INDEX(Q5:Q109,MATCH(TRUE,(B5:B109=\"End\"),0)))))","v":""},"",null,"Add your Funds here",null,"Withdraw  your Funds here",null,null,"","","","","","","","",null,"","","","","","","",null,"","","","","","","",null,"","","","","","",{"$f":"IF(FAX5&BA5&BB5&BC5&BD5&BE5=\"\",\"\",SUM(AZ5:BE5))","v":""},null,"","","","","","",""]
[4,null,null,null,null,null,null,null,null,null,null,null,"","","","","",{"$f":"IF(C6=\"\",\"\",IF(ISNUMBER(SEARCH(\"Start&End\",B6)),SUM(P6:INDEX(P6:P110,MATCH(TRUE,(B6:B110=\"Start&End\"),0))),SUM(P6:INDEX(P6:P110,MATCH(TRUE,(B6:B110=\"End\"),0)))))","v":""},{"$f":"IF(C6=\"\",\"\",IF(ISNUMBER(SEARCH(\"Start&End\",B6)),SUM(Q6:INDEX(Q6:Q110,MATCH(TRUE,(B6:B110=\"Start&End\"),0))),SUM(Q6:INDEX(Q6:Q110,MATCH(TRUE,(B6:B110=\"End\"),0)))))","v":""},"",null,"Sr.no","Funds added","Sr.no","Funds Withdrew",null,"","","","","","","","",null,"","","","","","","",null,"","","","","","","",null,"","","","","","","",null,"","","","","","",""]
[5,null,null,null,null,null,null,null,null,null,null,null,"","","","","",{"$f":"IF(C7=\"\",\"\",IF(ISNUMBER(SEARCH(\"Start&End\",B7)),SUM(P7:INDEX(P7:P111,MATCH(TRUE,(B7:B111=\"Start&End\"),0))),SUM(P7:INDEX(P7:P111,MATCH(TRUE,(B7:B111=\"End\"),0)))))","v":""},{"$f":"IF(C7=\"\",\"\",IF(ISNUMBER(SEARCH(\"Start&End\",B7)),SUM(Q7:INDEX(Q7:Q111,MATCH(TRUE,(B7:B111=\"Start&End\"),0))),SUM(Q7:INDEX(Q7:Q111,MATCH(TRUE,(B7:B111=\"End\"),0)))))","v":""},"",null,1,15000,1,null,null,"","","","","","","","",null,"","","","","","","",null,"","","","","","","",null,"","","","","","","",null,"","","","","","",""]
[6,null,null,null,null,null,null,null,null,null,null,null,"","","","","",{"$f":"IF(C8=\"\",\"\",IF(ISNUMBER(SEARCH(\"Start&End\",B8)),SUM(P8:INDEX(P8:P112,MATCH(TRUE,(B8:B112=\"Start&End\"),0))),SUM(P8:INDEX(P8:P112,MATCH(TRUE,(B8:B112=\"End\"),0)))))","v":""},{"$f":"IF(C8=\"\",\"\",IF(ISNUMBER(SEARCH(\"Start&End\",B8)),SUM(Q8:INDEX(Q8:Q112,MATCH(TRUE,(B8:B112=\"Start&End\"),0))),SUM(Q8:INDEX(Q8:Q112,MATCH(TRUE,(B8:B112=\"End\"),0)))))","v":""},"",null,null,null,null,null,null,"","","","","","","","",null,"","","","","","","",null,"","","","","","","",null,"","","","","","","",null,"","","","","","",""]
[7,null,null,null,null,null,null,null,null,null,null,null,"","","","","",{"$f":"IF(C9=\"\",\"\",IF(ISNUMBER(SEARCH(\"Start&End\",B9)),SUM(P9:INDEX(P9:P113,MATCH(TRUE,(B9:B113=\"Start&End\"),0))),SUM(P9:INDEX(P9:P113,MATCH(TRUE,(B9:B113=\"End\"),0)))))","v":""},{"$f":"IF(C9=\"\",\"\",IF(ISNUMBER(SEARCH(\"Start&End\",B9)),SUM(Q9:INDEX(Q9:Q113,MATCH(TRUE,(B9:B113=\"Start&End\"),0))),SUM(Q9:INDEX(Q9:Q113,MATCH(TRUE,(B9:B113=\"End\"),0)))))","v":""},"",null,null,null,null,null,null,"","","","","","","","",null,"","","","","","","",null,"","","","","","","",null,"","","","","","","",null,"","","","","","",""]
[8,null,null,null,null,null,null,null,null,null,null,null,"","","","","",{"$f":"IF(C10=\"\",\"\",IF(ISNUMBER(SEARCH(\"Start&End\",B10)),SUM(P10:INDEX(P10:P114,MATCH(TRUE,(B10:B114=\"Start&End\"),0))),SUM(P10:INDEX(P10:P114,MATCH(TRUE,(B10:B114=\"End\"),0)))))","v":""},{"$f":"IF(C10=\"\",\"\",IF(ISNUMBER(SEARCH(\"Start&End\",B10)),SUM(Q10:INDEX(Q10:Q114,MATCH(TRUE,(B10:B114=\"Start&End\"),0))),SUM(Q10:INDEX(Q10:Q114,MATCH(TRUE,(B10:B114=\"End\"),0)))))","v":""},"",null,null,null,null,null,null,"","","","","","","","",null,"","","","","","","",null,"","","","","","","",null,"","","","","","","",null,"","","","","","",""]
[9,null,null,null,null,null,null,null,null,null,null,null,"","","","","",{"$f":"IF(C11=\"\",\"\",IF(ISNUMBER(SEARCH(\"Start&End\",B11)),SUM(P11:INDEX(P11:P115,MATCH(TRUE,(B11:B115=\"Start&End\"),0))),SUM(P11:INDEX(P11:P115,MATCH(TRUE,(B11:B115=\"End\"),0)))))","v":""},{"$f":"IF(C11=\"\",\"\",IF(ISNUMBER(SEARCH(\"Start&End\",B11)),SUM(Q11:INDEX(Q11:Q115,MATCH(TRUE,(B11:B115=\"Start&End\"),0))),SUM(Q11:INDEX(Q11:Q115,MATCH(TRUE,(B11:B115=\"End\"),0)))))","v":""},"",null,null,null,null,null,null,"","","",{"$f":"IF(ISNUMBER(SEARCH(\"HOLD\",E11)),AL11,IF(ISNUMBER(SEARCH(\"INTRA\",E11)),AT11,IF(ISNUMBER(SEARCH(\"FUT\",E11)),BB11,BJ11)))","v":""},"","","","",null,"","","","","","","",null,"","","","","","","",null,"","","","","","","",null,"","","","","","",""]
[10,null,null,null,null,null,null,null,null,null,null,null,"","","","","",{"$f":"IF(C12=\"\",\"\",IF(ISNUMBER(SEARCH(\"Start&End\",B12)),SUM(P12:INDEX(P12:P116,MATCH(TRUE,(B12:B116=\"Start&End\"),0))),SUM(P12:INDEX(P12:P116,MATCH(TRUE,(B12:B116=\"End\"),0)))))","v":""},{"$f":"IF(C12=\"\",\"\",IF(ISNUMBER(SEARCH(\"Start&End\",B12)),SUM(Q12:INDEX(Q12:Q116,MATCH(TRUE,(B12:B116=\"Start&End\"),0))),SUM(Q12:INDEX(Q12:Q116,MATCH(TRUE,(B12:B116=\"End\"),0)))))","v":""},"",null,null,null,null,null,null,"","","","","","","","",null,"","","","","","","",null,"","","","","","","",null,"","","","","","","",null,"","","","","","",""]
[11,null,null,null,null,null,null,null,null,null,null,null,"","","","","",{"$f":"IF(C13=\"\",\"\",IF(ISNUMBER(SEARCH(\"Start&End\",B13)),SUM(P13:INDEX(P13:P117,MATCH(TRUE,(B13:B117=\"Start&End\"),0))),SUM(P13:INDEX(P13:P117,MATCH(TRUE,(B13:B117=\"End\"),0)))))","v":""},{"$f":"IF(C13=\"\",\"\",IF(ISNUMBER(SEARCH(\"Start&End\",B13)),SUM(Q13:INDEX(Q13:Q117,MATCH(TRUE,(B13:B117=\"Start&End\"),0))),SUM(Q13:INDEX(Q13:Q117,MATCH(TRUE,(B13:B117=\"End\"),0)))))","v":""},"",null,null,null,null,null,null,"","","","","","","","",null,"","","","","","","",null,"","","","","","","",null,"","","","","","","",null,"","","","","","",""]
[12,null,null,null,null,null,null,null,null,null,null,null,"","","","","",{"$f":"IF(C14=\"\",\"\",IF(ISNUMBER(SEARCH(\"Start&End\",B14)),SUM(P14:INDEX(P14:P118,MATCH(TRUE,(B14:B118=\"Start&End\"),0))),SUM(P14:INDEX(P14:P118,MATCH(TRUE,(B14:B118=\"End\"),0)))))","v":""},{"$f":"IF(C14=\"\",\"\",IF(ISNUMBER(SEARCH(\"Start&End\",B14)),SUM(Q14:INDEX(Q14:Q118,MATCH(TRUE,(B14:B118=\"Start&End\"),0))),SUM(Q14:INDEX(Q14:Q118,MATCH(TRUE,(B14:B118=\"End\"),0)))))","v":""},"",null,null,null,null,null,null,"","","","","","","","",null,"","","","","","","",null,"","","","","","","",null,"","","","","","","",null,"","","","","","",""]
[13,null,null,null,null,null,null,null,null,null,null,null,"","","","","",{"$f":"IF(C15=\"\",\"\",IF(ISNUMBER(SEARCH(\"Start&End\",B15)),SUM(P15:INDEX(P15:P119,MATCH(TRUE,(B15:B119=\"Start&End\"),0))),SUM(P15:INDEX(P15:P119,MATCH(TRUE,(B15:B119=\"End\"),0)))))","v":""},{"$f":"IF(C15=\"\",\"\",IF(ISNUMBER(SEARCH(\"Start&End\",B15)),SUM(Q15:INDEX(Q15:Q119,MATCH(TRUE,(B15:B119=\"Start&End\"),0))),SUM(Q15:INDEX(Q15:Q119,MATCH(TRUE,(B15:B119=\"End\"),0)))))","v":""},"",null,null,null,null,null,null,"","","","","","","","",null,"","","","","","","",null,"","","","","","","",null,"","","","","","","",null,"","","","","","",""]
[14,null,null,null,null,null,null,null,null,null,null,null,"","","","","",{"$f":"IF(C16=\"\",\"\",IF(ISNUMBER(SEARCH(\"Start&End\",B16)),SUM(P16:INDEX(P16:P120,MATCH(TRUE,(B16:B120=\"Start&End\"),0))),SUM(P16:INDEX(P16:P120,MATCH(TRUE,(B16:B120=\"End\"),0)))))","v":""},{"$f":"IF(C16=\"\",\"\",IF(ISNUMBER(SEARCH(\"Start&End\",B16)),SUM(Q16:INDEX(Q16:Q120,MATCH(TRUE,(B16:B120=\"Start&End\"),0))),SUM(Q16:INDEX(Q16:Q120,MATCH(TRUE,(B16:B120=\"End\"),0)))))","v":""},"",null,null,null,null,null,null,"","","","","","","","",null,"","","","","","","",null,"","","","","","","",null,"","","","","","","",null,"","","","","","",""]
[15,null,null,null,null,null,null,null,null,null,null,null,"","","","","",{"$f":"IF(C17=\"\",\"\",IF(ISNUMBER(SEARCH(\"Start&End\",B17)),SUM(P17:INDEX(P17:P121,MATCH(TRUE,(B17:B121=\"Start&End\"),0))),SUM(P17:INDEX(P17:P121,MATCH(TRUE,(B17:B121=\"End\"),0)))))","v":""},{"$f":"IF(C17=\"\",\"\",IF(ISNUMBER(SEARCH(\"Start&End\",B17)),SUM(Q17:INDEX(Q17:Q121,MATCH(TRUE,(B17:B121=\"Start&End\"),0))),SUM(Q17:INDEX(Q17:Q121,MATCH(TRUE,(B17:B121=\"End\"),0)))))","v":""},"",null,null,null,null,null,null,"","","","","","","","",null,"","","","","","","",null,"","","","","","","",null,"","","","","","","",null,"","","","","","",""]
[16,null,null,null,null,null,null,null,null,null,null,null,"","","","","",{"$f":"IF(C18=\"\",\"\",IF(ISNUMBER(SEARCH(\"Start&End\",B18)),SUM(P18:INDEX(P18:P122,MATCH(TRUE,(B18:B122=\"Start&End\"),0))),SUM(P18:INDEX(P18:P122,MATCH(TRUE,(B18:B122=\"End\"),0)))))","v":""},{"$f":"IF(C18=\"\",\"\",IF(ISNUMBER(SEARCH(\"Start&End\",B18)),SUM(Q18:INDEX(Q18:Q122,MATCH(TRUE,(B18:B122=\"Start&End\"),0))),SUM(Q18:INDEX(Q18:Q122,MATCH(TRUE,(B18:B122=\"End\"),0)))))","v":""},"",null,null,null,null,null,null,"","","","","","","","",null,"","","","","","","",null,"","","","","","","",null,"","","","","","","",null,"","","","","","",""]
[17,null,null,null,null,null,null,null,null,null,null,null,"","","","","",{"$f":"IF(C19=\"\",\"\",IF(ISNUMBER(SEARCH(\"Start&End\",B19)),SUM(P19:INDEX(P19:P123,MATCH(TRUE,(B19:B123=\"Start&End\"),0))),SUM(P19:INDEX(P19:P123,MATCH(TRUE,(B19:B123=\"End\"),0)))))","v":""},{"$f":"IF(C19=\"\",\"\",IF(ISNUMBER(SEARCH(\"Start&End\",B19)),SUM(Q19:INDEX(Q19:Q123,MATCH(TRUE,(B19:B123=\"Start&End\"),0))),SUM(Q19:INDEX(Q19:Q123,MATCH(TRUE,(B19:B123=\"End\"),0)))))","v":""},"",null,null,null,null,null,null,"","","","","","","","",null,"","","","","","","",null,"","","","","","","",null,"","","","","","","",null,"","","","","","",""]
[18,null,null,null,null,null,null,null,null,null,null,null,"","","","","",{"$f":"IF(C20=\"\",\"\",IF(ISNUMBER(SEARCH(\"Start&End\",B20)),SUM(P20:INDEX(P20:P124,MATCH(TRUE,(B20:B124=\"Start&End\"),0))),SUM(P20:INDEX(P20:P124,MATCH(TRUE,(B20:B124=\"End\"),0)))))","v":""},{"$f":"IF(C20=\"\",\"\",IF(ISNUMBER(SEARCH(\"Start&End\",B20)),SUM(Q20:INDEX(Q20:Q124,MATCH(TRUE,(B20:B124=\"Start&End\"),0))),SUM(Q20:INDEX(Q20:Q124,MATCH(TRUE,(B20:B124=\"End\"),0)))))","v":""},"",null,null,null,null,null,null,"","","","","","","","",null,"","","","","","","",null,"","","","","","","",null,"","","","","","","",null,"","","","","","",""]
[19,null,null,null,null,null,null,null,null,null,null,null,"","","","","",{"$f":"IF(C21=\"\",\"\",IF(ISNUMBER(SEARCH(\"Start&End\",B21)),SUM(P21:INDEX(P21:P125,MATCH(TRUE,(B21:B125=\"Start&End\"),0))),SUM(P21:INDEX(P21:P125,MATCH(TRUE,(B21:B125=\"End\"),0)))))","v":""},{"$f":"IF(C21=\"\",\"\",IF(ISNUMBER(SEARCH(\"Start&End\",B21)),SUM(Q21:INDEX(Q21:Q125,MATCH(TRUE,(B21:B125=\"Start&End\"),0))),SUM(Q21:INDEX(Q21:Q125,MATCH(TRUE,(B21:B125=\"End\"),0)))))","v":""},"",null,null,null,null,null,null,"","","","","","","","",null,"","","","","","","",null,"","","","","","","",null,"","","","","","","",null,"","","","","","",""]
[20,null,null,null,null,null,null,null,null,null,null,null,"","","","","",{"$f":"IF(C22=\"\",\"\",IF(ISNUMBER(SEARCH(\"Start&End\",B22)),SUM(P22:INDEX(P22:P126,MATCH(TRUE,(B22:B126=\"Start&End\"),0))),SUM(P22:INDEX(P22:P126,MATCH(TRUE,(B22:B126=\"End\"),0)))))","v":""},{"$f":"IF(C22=\"\",\"\",IF(ISNUMBER(SEARCH(\"Start&End\",B22)),SUM(Q22:INDEX(Q22:Q126,MATCH(TRUE,(B22:B126=\"Start&End\"),0))),SUM(Q22:INDEX(Q22:Q126,MATCH(TRUE,(B22:B126=\"End\"),0)))))","v":""},"",null,null,null,null,null,null,"","","","","","","","",null,"","","","","","","",null,"","","","","","","",null,"","","","","","","",null,"","","","","","",""]
[21,null,null,null,null,null,null,null,null,null,null,null,"","","","","",{"$f":"IF(C23=\"\",\"\",IF(ISNUMBER(SEARCH(\"Start&End\",B23)),SUM(P23:INDEX(P23:P127,MATCH(TRUE,(B23:B127=\"Start&End\"),0))),SUM(P23:INDEX(P23:P127,MATCH(TRUE,(B23:B127=\"End\"),0)))))","v":""},{"$f":"IF(C23=\"\",\"\",IF(ISNUMBER(SEARCH(\"Start&End\",B23)),SUM(Q23:INDEX(Q23:Q127,MATCH(TRUE,(B23:B127=\"Start&End\"),0))),SUM(Q23:INDEX(Q23:Q127,MATCH(TRUE,(B23:B127=\"End\"),0)))))","v":""},"",null,null,null,null,null,null,"","","","","","","","",null,"","","","","","","",null,"","","","","","","",null,"","","","","","","",null,"","","","","","",""]
[22,null,null,null,null,null,null,null,null,null,null,null,"","","","","",{"$f":"IF(C24=\"\",\"\",IF(ISNUMBER(SEARCH(\"Start&End\",B24)),SUM(P24:INDEX(P24:P128,MATCH(TRUE,(B24:B128=\"Start&End\"),0))),SUM(P24:INDEX(P24:P128,MATCH(TRUE,(B24:B128=\"End\"),0)))))","v":""},{"$f":"IF(C24=\"\",\"\",IF(ISNUMBER(SEARCH(\"Start&End\",B24)),SUM(Q24:INDEX(Q24:Q128,MATCH(TRUE,(B24:B128=\"Start&End\"),0))),SUM(Q24:INDEX(Q24:Q128,MATCH(TRUE,(B24:B128=\"End\"),0)))))","v":""},"",null,null,null,null,null,null,"","","","","","","","",null,"","","","","","","",null,"","","","","","","",null,"","","","","","","",null,"","","","","","",""]
[23,null,null,null,null,null,null,null,null,null,null,null,"","","","","",{"$f":"IF(C25=\"\",\"\",IF(ISNUMBER(SEARCH(\"Start&End\",B25)),SUM(P25:INDEX(P25:P129,MATCH(TRUE,(B25:B129=\"Start&End\"),0))),SUM(P25:INDEX(P25:P129,MATCH(TRUE,(B25:B129=\"End\"),0)))))","v":""},{"$f":"IF(C25=\"\",\"\",IF(ISNUMBER(SEARCH(\"Start&End\",B25)),SUM(Q25:INDEX(Q25:Q129,MATCH(TRUE,(B25:B129=\"Start&End\"),0))),SUM(Q25:INDEX(Q25:Q129,MATCH(TRUE,(B25:B129=\"End\"),0)))))","v":""},"",null,null,null,null,null,null,"","","","","","","","",null,"","","","","","","",null,"","","","","","","",null,"","","","","","","",null,"","","","","","",""]
[24,null,null,null,null,null,null,null,null,null,null,null,"","","","","",{"$f":"IF(C26=\"\",\"\",IF(ISNUMBER(SEARCH(\"Start&End\",B26)),SUM(P26:INDEX(P26:P130,MATCH(TRUE,(B26:B130=\"Start&End\"),0))),SUM(P26:INDEX(P26:P130,MATCH(TRUE,(B26:B130=\"End\"),0)))))","v":""},{"$f":"IF(C26=\"\",\"\",IF(ISNUMBER(SEARCH(\"Start&End\",B26)),SUM(Q26:INDEX(Q26:Q130,MATCH(TRUE,(B26:B130=\"Start&End\"),0))),SUM(Q26:INDEX(Q26:Q130,MATCH(TRUE,(B26:B130=\"End\"),0)))))","v":""},"",null,null,null,null,null,null,"","","","","","","","",null,"","","","","","","",null,"","","","","","","",null,"","","","","","","",null,"","","","","","",""]
[25,null,null,null,null,null,null,null,null,null,null,null,"","","","","",{"$f":"IF(C27=\"\",\"\",IF(ISNUMBER(SEARCH(\"Start&End\",B27)),SUM(P27:INDEX(P27:P131,MATCH(TRUE,(B27:B131=\"Start&End\"),0))),SUM(P27:INDEX(P27:P131,MATCH(TRUE,(B27:B131=\"End\"),0)))))","v":""},{"$f":"IF(C27=\"\",\"\",IF(ISNUMBER(SEARCH(\"Start&End\",B27)),SUM(Q27:INDEX(Q27:Q131,MATCH(TRUE,(B27:B131=\"Start&End\"),0))),SUM(Q27:INDEX(Q27:Q131,MATCH(TRUE,(B27:B131=\"End\"),0)))))","v":""},"",null,null,null,null,null,null,"","","","","","","","",null,"","","","","","","",null,"","","","","","","",null,"","","","","","","",null,"","","","","","",""]
[26,null,null,null,null,null,null,null,null,null,null,null,"","","","","",{"$f":"IF(C28=\"\",\"\",IF(ISNUMBER(SEARCH(\"Start&End\",B28)),SUM(P28:INDEX(P28:P132,MATCH(TRUE,(B28:B132=\"Start&End\"),0))),SUM(P28:INDEX(P28:P132,MATCH(TRUE,(B28:B132=\"End\"),0)))))","v":""},{"$f":"IF(C28=\"\",\"\",IF(ISNUMBER(SEARCH(\"Start&End\",B28)),SUM(Q28:INDEX(Q28:Q132,MATCH(TRUE,(B28:B132=\"Start&End\"),0))),SUM(Q28:INDEX(Q28:Q132,MATCH(TRUE,(B28:B132=\"End\"),0)))))","v":""},"",null,null,null,null,null,null,"","","","","","","","",null,"","","","","","","",null,"","","","","","","",null,"","","","","","","",null,"","","","","","",""]
[27,null,null,null,null,null,null,null,null,null,null,null,"","","","","",{"$f":"IF(C29=\"\",\"\",IF(ISNUMBER(SEARCH(\"Start&End\",B29)),SUM(P29:INDEX(P29:P133,MATCH(TRUE,(B29:B133=\"Start&End\"),0))),SUM(P29:INDEX(P29:P133,MATCH(TRUE,(B29:B133=\"End\"),0)))))","v":""},{"$f":"IF(C29=\"\",\"\",IF(ISNUMBER(SEARCH(\"Start&End\",B29)),SUM(Q29:INDEX(Q29:Q133,MATCH(TRUE,(B29:B133=\"Start&End\"),0))),SUM(Q29:INDEX(Q29:Q133,MATCH(TRUE,(B29:B133=\"End\"),0)))))","v":""},"",null,null,null,null,null,null,"","","","","","","","",null,"","","","","","","",null,"","","","","","","",null,"","","","","","","",null,"","","","","","",""]
[28,null,null,null,null,null,null,null,null,null,null,null,"","","","","",{"$f":"IF(C30=\"\",\"\",IF(ISNUMBER(SEARCH(\"Start&End\",B30)),SUM(P30:INDEX(P30:P134,MATCH(TRUE,(B30:B134=\"Start&End\"),0))),SUM(P30:INDEX(P30:P134,MATCH(TRUE,(B30:B134=\"End\"),0)))))","v":""},{"$f":"IF(C30=\"\",\"\",IF(ISNUMBER(SEARCH(\"Start&End\",B30)),SUM(Q30:INDEX(Q30:Q134,MATCH(TRUE,(B30:B134=\"Start&End\"),0))),SUM(Q30:INDEX(Q30:Q134,MATCH(TRUE,(B30:B134=\"End\"),0)))))","v":""},"",null,null,null,null,null,null,"","","","","","","","",null,"","","","","","","",null,"","","","","","","",null,"","","","","","","",null,"","","","","","",""]
[29,null,null,null,null,null,null,null,null,null,null,null,"","","","","",{"$f":"IF(C31=\"\",\"\",IF(ISNUMBER(SEARCH(\"Start&End\",B31)),SUM(P31:INDEX(P31:P135,MATCH(TRUE,(B31:B135=\"Start&End\"),0))),SUM(P31:INDEX(P31:P135,MATCH(TRUE,(B31:B135=\"End\"),0)))))","v":""},{"$f":"IF(C31=\"\",\"\",IF(ISNUMBER(SEARCH(\"Start&End\",B31)),SUM(Q31:INDEX(Q31:Q135,MATCH(TRUE,(B31:B135=\"Start&End\"),0))),SUM(Q31:INDEX(Q31:Q135,MATCH(TRUE,(B31:B135=\"End\"),0)))))","v":""},"",null,null,null,null,null,null,"","","","","","","","",null,"","","","","","","",null,"","","","","","","",null,"","","","","","","",null,"","","","","","",""]
[30,null,null,null,null,null,null,null,null,null,null,null,"","","","","",{"$f":"IF(C32=\"\",\"\",IF(ISNUMBER(SEARCH(\"Start&End\",B32)),SUM(P32:INDEX(P32:P136,MATCH(TRUE,(B32:B136=\"Start&End\"),0))),SUM(P32:INDEX(P32:P136,MATCH(TRUE,(B32:B136=\"End\"),0)))))","v":""},{"$f":"IF(C32=\"\",\"\",IF(ISNUMBER(SEARCH(\"Start&End\",B32)),SUM(Q32:INDEX(Q32:Q136,MATCH(TRUE,(B32:B136=\"Start&End\"),0))),SUM(Q32:INDEX(Q32:Q136,MATCH(TRUE,(B32:B136=\"End\"),0)))))","v":""},"",null,null,null,null,null,null,"","","","","","","","",null,"","","","","","","",null,"","","","","","","",null,"","","","","","","",null,"","","","","","",""]
[31,null,null,null,null,null,null,null,null,null,null,null,"","","","","",{"$f":"IF(C33=\"\",\"\",IF(ISNUMBER(SEARCH(\"Start&End\",B33)),SUM(P33:INDEX(P33:P137,MATCH(TRUE,(B33:B137=\"Start&End\"),0))),SUM(P33:INDEX(P33:P137,MATCH(TRUE,(B33:B137=\"End\"),0)))))","v":""},{"$f":"IF(C33=\"\",\"\",IF(ISNUMBER(SEARCH(\"Start&End\",B33)),SUM(Q33:INDEX(Q33:Q137,MATCH(TRUE,(B33:B137=\"Start&End\"),0))),SUM(Q33:INDEX(Q33:Q137,MATCH(TRUE,(B33:B137=\"End\"),0)))))","v":""},"",null,null,null,null,null,null,"","","","","","","","",null,"","","","","","","",null,"","","","","","","",null,"","","","","","","",null,"","","","","","",""]
[32,null,null,null,null,null,null,null,null,null,null,null,"","","","","",{"$f":"IF(C34=\"\",\"\",IF(ISNUMBER(SEARCH(\"Start&End\",B34)),SUM(P34:INDEX(P34:P138,MATCH(TRUE,(B34:B138=\"Start&End\"),0))),SUM(P34:INDEX(P34:P138,MATCH(TRUE,(B34:B138=\"End\"),0)))))","v":""},{"$f":"IF(C34=\"\",\"\",IF(ISNUMBER(SEARCH(\"Start&End\",B34)),SUM(Q34:INDEX(Q34:Q138,MATCH(TRUE,(B34:B138=\"Start&End\"),0))),SUM(Q34:INDEX(Q34:Q138,MATCH(TRUE,(B34:B138=\"End\"),0)))))","v":""},"",null,null,null,null,null,null,"","","","","","","","",null,"","","","","","","",null,"","","","","","","",null,"","","","","","","",null,"","","","","","",""]
[33,null,null,null,null,null,null,null,null,null,null,null,"","","","","",{"$f":"IF(C35=\"\",\"\",IF(ISNUMBER(SEARCH(\"Start&End\",B35)),SUM(P35:INDEX(P35:P139,MATCH(TRUE,(B35:B139=\"Start&End\"),0))),SUM(P35:INDEX(P35:P139,MATCH(TRUE,(B35:B139=\"End\"),0)))))","v":""},{"$f":"IF(C35=\"\",\"\",IF(ISNUMBER(SEARCH(\"Start&End\",B35)),SUM(Q35:INDEX(Q35:Q139,MATCH(TRUE,(B35:B139=\"Start&End\"),0))),SUM(Q35:INDEX(Q35:Q139,MATCH(TRUE,(B35:B139=\"End\"),0)))))","v":""},"",null,null,null,null,null,null,"","","","","","","","",null,"","","","","","","",null,"","","","","","","",null,"","","","","","","",null,"","","","","","",""]
[34,null,null,null,null,null,null,null,null,null,null,null,"","","","","",{"$f":"IF(C36=\"\",\"\",IF(ISNUMBER(SEARCH(\"Start&End\",B36)),SUM(P36:INDEX(P36:P140,MATCH(TRUE,(B36:B140=\"Start&End\"),0))),SUM(P36:INDEX(P36:P140,MATCH(TRUE,(B36:B140=\"End\"),0)))))","v":""},{"$f":"IF(C36=\"\",\"\",IF(ISNUMBER(SEARCH(\"Start&End\",B36)),SUM(Q36:INDEX(Q36:Q140,MATCH(TRUE,(B36:B140=\"Start&End\"),0))),SUM(Q36:INDEX(Q36:Q140,MATCH(TRUE,(B36:B140=\"End\"),0)))))","v":""},"",null,null,null,null,null,null,"","","","","","","","",null,"","","","","","","",null,"","","","","","","",null,"","","","","","","",null,"","","","","","",""]
[35,null,null,null,null,null,null,null,null,null,null,null,"","","","","",{"$f":"IF(C37=\"\",\"\",IF(ISNUMBER(SEARCH(\"Start&End\",B37)),SUM(P37:INDEX(P37:P141,MATCH(TRUE,(B37:B141=\"Start&End\"),0))),SUM(P37:INDEX(P37:P141,MATCH(TRUE,(B37:B141=\"End\"),0)))))","v":""},{"$f":"IF(C37=\"\",\"\",IF(ISNUMBER(SEARCH(\"Start&End\",B37)),SUM(Q37:INDEX(Q37:Q141,MATCH(TRUE,(B37:B141=\"Start&End\"),0))),SUM(Q37:INDEX(Q37:Q141,MATCH(TRUE,(B37:B141=\"End\"),0)))))","v":""},"",null,null,null,null,null,null,"","","","","","","","",null,"","","","","","","",null,"","","","","","","",null,"","","","","","","",null,"","","","","","",""]
[36,null,null,null,null,null,null,null,null,null,null,null,"","","","","",{"$f":"IF(C38=\"\",\"\",IF(ISNUMBER(SEARCH(\"Start&End\",B38)),SUM(P38:INDEX(P38:P142,MATCH(TRUE,(B38:B142=\"Start&End\"),0))),SUM(P38:INDEX(P38:P142,MATCH(TRUE,(B38:B142=\"End\"),0)))))","v":""},{"$f":"IF(C38=\"\",\"\",IF(ISNUMBER(SEARCH(\"Start&End\",B38)),SUM(Q38:INDEX(Q38:Q142,MATCH(TRUE,(B38:B142=\"Start&End\"),0))),SUM(Q38:INDEX(Q38:Q142,MATCH(TRUE,(B38:B142=\"End\"),0)))))","v":""},"",null,null,null,null,null,null,"","","","","","","","",null,"","","","","","","",null,"","","","","","","",null,"","","","","","","",null,"","","","","","",""]
[37,null,null,null,null,null,null,null,null,null,null,null,"","","","","",{"$f":"IF(C39=\"\",\"\",IF(ISNUMBER(SEARCH(\"Start&End\",B39)),SUM(P39:INDEX(P39:P143,MATCH(TRUE,(B39:B143=\"Start&End\"),0))),SUM(P39:INDEX(P39:P143,MATCH(TRUE,(B39:B143=\"End\"),0)))))","v":""},{"$f":"IF(C39=\"\",\"\",IF(ISNUMBER(SEARCH(\"Start&End\",B39)),SUM(Q39:INDEX(Q39:Q143,MATCH(TRUE,(B39:B143=\"Start&End\"),0))),SUM(Q39:INDEX(Q39:Q143,MATCH(TRUE,(B39:B143=\"End\"),0)))))","v":""},"",null,null,null,null,null,null,"","","","","","","","",null,"","","","","","","",null,"","","","","","","",null,"","","","","","","",null,"","","","","","",""]
[38,null,null,null,null,null,null,null,null,null,null,null,"","","","","",{"$f":"IF(C40=\"\",\"\",IF(ISNUMBER(SEARCH(\"Start&End\",B40)),SUM(P40:INDEX(P40:P144,MATCH(TRUE,(B40:B144=\"Start&End\"),0))),SUM(P40:INDEX(P40:P144,MATCH(TRUE,(B40:B144=\"End\"),0)))))","v":""},{"$f":"IF(C40=\"\",\"\",IF(ISNUMBER(SEARCH(\"Start&End\",B40)),SUM(Q40:INDEX(Q40:Q144,MATCH(TRUE,(B40:B144=\"Start&End\"),0))),SUM(Q40:INDEX(Q40:Q144,MATCH(TRUE,(B40:B144=\"End\"),0)))))","v":""},"",null,null,null,null,null,null,"","","","","","","","",null,"","","","","","","",null,"","","","","","","",null,"","","","","","","",null,"","","","","","",""]
[39,null,null,null,null,null,null,null,null,null,null,null,"","","","","",{"$f":"IF(C41=\"\",\"\",IF(ISNUMBER(SEARCH(\"Start&End\",B41)),SUM(P41:INDEX(P41:P145,MATCH(TRUE,(B41:B145=\"Start&End\"),0))),SUM(P41:INDEX(P41:P145,MATCH(TRUE,(B41:B145=\"End\"),0)))))","v":""},{"$f":"IF(C41=\"\",\"\",IF(ISNUMBER(SEARCH(\"Start&End\",B41)),SUM(Q41:INDEX(Q41:Q145,MATCH(TRUE,(B41:B145=\"Start&End\"),0))),SUM(Q41:INDEX(Q41:Q145,MATCH(TRUE,(B41:B145=\"End\"),0)))))","v":""},"",null,null,null,null,null,null,"","","","","","","","",null,"","","","","","","",null,"","","","","","","",null,"","","","","","","",null,"","","","","","",""]
[40,null,null,null,null,null,null,null,null,null,null,null,"","","","","",{"$f":"IF(C42=\"\",\"\",IF(ISNUMBER(SEARCH(\"Start&End\",B42)),SUM(P42:INDEX(P42:P146,MATCH(TRUE,(B42:B146=\"Start&End\"),0))),SUM(P42:INDEX(P42:P146,MATCH(TRUE,(B42:B146=\"End\"),0)))))","v":""},{"$f":"IF(C42=\"\",\"\",IF(ISNUMBER(SEARCH(\"Start&End\",B42)),SUM(Q42:INDEX(Q42:Q146,MATCH(TRUE,(B42:B146=\"Start&End\"),0))),SUM(Q42:INDEX(Q42:Q146,MATCH(TRUE,(B42:B146=\"End\"),0)))))","v":""},"",null,null,null,null,null,null,"","","","","","","","",null,"","","","","","","",null,"","","","","","","",null,"","","","","","","",null,"","","","","","",""]
[41,null,null,null,null,null,null,null,null,null,null,null,"","","","","",{"$f":"IF(C43=\"\",\"\",IF(ISNUMBER(SEARCH(\"Start&End\",B43)),SUM(P43:INDEX(P43:P147,MATCH(TRUE,(B43:B147=\"Start&End\"),0))),SUM(P43:INDEX(P43:P147,MATCH(TRUE,(B43:B147=\"End\"),0)))))","v":""},{"$f":"IF(C43=\"\",\"\",IF(ISNUMBER(SEARCH(\"Start&End\",B43)),SUM(Q43:INDEX(Q43:Q147,MATCH(TRUE,(B43:B147=\"Start&End\"),0))),SUM(Q43:INDEX(Q43:Q147,MATCH(TRUE,(B43:B147=\"End\"),0)))))","v":""},"",null,null,null,null,null,null,"","","","","","","","",null,"","","","","","","",null,"","","","","","","",null,"","","","","","","",null,"","","","","","",""]
[42,null,null,null,null,null,null,null,null,null,null,null,"","","","","",{"$f":"IF(C44=\"\",\"\",IF(ISNUMBER(SEARCH(\"Start&End\",B44)),SUM(P44:INDEX(P44:P148,MATCH(TRUE,(B44:B148=\"Start&End\"),0))),SUM(P44:INDEX(P44:P148,MATCH(TRUE,(B44:B148=\"End\"),0)))))","v":""},{"$f":"IF(C44=\"\",\"\",IF(ISNUMBER(SEARCH(\"Start&End\",B44)),SUM(Q44:INDEX(Q44:Q148,MATCH(TRUE,(B44:B148=\"Start&End\"),0))),SUM(Q44:INDEX(Q44:Q148,MATCH(TRUE,(B44:B148=\"End\"),0)))))","v":""},"",null,null,null,null,null,null,"","","","","","","","",null,"","","","","","","",null,"","","","","","","",null,"","","","","","","",null,"","","","","","",""]
[43,null,null,null,null,null,null,null,null,null,null,null,"","","","","",{"$f":"IF(C45=\"\",\"\",IF(ISNUMBER(SEARCH(\"Start&End\",B45)),SUM(P45:INDEX(P45:P149,MATCH(TRUE,(B45:B149=\"Start&End\"),0))),SUM(P45:INDEX(P45:P149,MATCH(TRUE,(B45:B149=\"End\"),0)))))","v":""},{"$f":"IF(C45=\"\",\"\",IF(ISNUMBER(SEARCH(\"Start&End\",B45)),SUM(Q45:INDEX(Q45:Q149,MATCH(TRUE,(B45:B149=\"Start&End\"),0))),SUM(Q45:INDEX(Q45:Q149,MATCH(TRUE,(B45:B149=\"End\"),0)))))","v":""},"",null,null,null,null,null,null,"","","","","","","","",null,"","","","","","","",null,"","","","","","","",null,"","","","","","","",null,"","","","","","",""]
[44,null,null,null,null,null,null,null,null,null,null,null,"","","","","",{"$f":"IF(C46=\"\",\"\",IF(ISNUMBER(SEARCH(\"Start&End\",B46)),SUM(P46:INDEX(P46:P150,MATCH(TRUE,(B46:B150=\"Start&End\"),0))),SUM(P46:INDEX(P46:P150,MATCH(TRUE,(B46:B150=\"End\"),0)))))","v":""},{"$f":"IF(C46=\"\",\"\",IF(ISNUMBER(SEARCH(\"Start&End\",B46)),SUM(Q46:INDEX(Q46:Q150,MATCH(TRUE,(B46:B150=\"Start&End\"),0))),SUM(Q46:INDEX(Q46:Q150,MATCH(TRUE,(B46:B150=\"End\"),0)))))","v":""},"",null,null,null,null,null,null,"","","","","","","","",null,"","","","","","","",null,"","","","","","","",null,"","","","","","","",null,"","","","","","",""]
[45,null,null,null,null,null,null,null,null,null,null,null,"","","","","",{"$f":"IF(C47=\"\",\"\",IF(ISNUMBER(SEARCH(\"Start&End\",B47)),SUM(P47:INDEX(P47:P151,MATCH(TRUE,(B47:B151=\"Start&End\"),0))),SUM(P47:INDEX(P47:P151,MATCH(TRUE,(B47:B151=\"End\"),0)))))","v":""},{"$f":"IF(C47=\"\",\"\",IF(ISNUMBER(SEARCH(\"Start&End\",B47)),SUM(Q47:INDEX(Q47:Q151,MATCH(TRUE,(B47:B151=\"Start&End\"),0))),SUM(Q47:INDEX(Q47:Q151,MATCH(TRUE,(B47:B151=\"End\"),0)))))","v":""},"",null,null,null,null,null,null,"","","","","","","","",null,"","","","","","","",null,"","","","","","","",null,"","","","","","","",null,"","","","","","",""]
[46,null,null,null,null,null,null,null,null,null,null,null,"","","","","",{"$f":"IF(C48=\"\",\"\",IF(ISNUMBER(SEARCH(\"Start&End\",B48)),SUM(P48:INDEX(P48:P152,MATCH(TRUE,(B48:B152=\"Start&End\"),0))),SUM(P48:INDEX(P48:P152,MATCH(TRUE,(B48:B152=\"End\"),0)))))","v":""},{"$f":"IF(C48=\"\",\"\",IF(ISNUMBER(SEARCH(\"Start&End\",B48)),SUM(Q48:INDEX(Q48:Q152,MATCH(TRUE,(B48:B152=\"Start&End\"),0))),SUM(Q48:INDEX(Q48:Q152,MATCH(TRUE,(B48:B152=\"End\"),0)))))","v":""},"",null,null,null,null,null,null,"","","","","","","","",null,"","","","","","","",null,"","","","","","","",null,"","","","","","","",null,"","","","","","",""]
[47,null,null,null,null,null,null,null,null,null,null,null,"","","","","",{"$f":"IF(C49=\"\",\"\",IF(ISNUMBER(SEARCH(\"Start&End\",B49)),SUM(P49:INDEX(P49:P153,MATCH(TRUE,(B49:B153=\"Start&End\"),0))),SUM(P49:INDEX(P49:P153,MATCH(TRUE,(B49:B153=\"End\"),0)))))","v":""},{"$f":"IF(C49=\"\",\"\",IF(ISNUMBER(SEARCH(\"Start&End\",B49)),SUM(Q49:INDEX(Q49:Q153,MATCH(TRUE,(B49:B153=\"Start&End\"),0))),SUM(Q49:INDEX(Q49:Q153,MATCH(TRUE,(B49:B153=\"End\"),0)))))","v":""},"",null,null,null,null,null,null,"","","","","","","","",null,"","","","","","","",null,"","","","","","","",null,"","","","","","","",null,"","","","","","",""]
[48,null,null,null,null,null,null,null,null,null,null,null,"","","","","",{"$f":"IF(C50=\"\",\"\",IF(ISNUMBER(SEARCH(\"Start&End\",B50)),SUM(P50:INDEX(P50:P154,MATCH(TRUE,(B50:B154=\"Start&End\"),0))),SUM(P50:INDEX(P50:P154,MATCH(TRUE,(B50:B154=\"End\"),0)))))","v":""},{"$f":"IF(C50=\"\",\"\",IF(ISNUMBER(SEARCH(\"Start&End\",B50)),SUM(Q50:INDEX(Q50:Q154,MATCH(TRUE,(B50:B154=\"Start&End\"),0))),SUM(Q50:INDEX(Q50:Q154,MATCH(TRUE,(B50:B154=\"End\"),0)))))","v":""},"",null,null,null,null,null,null,"","","","","","","","",null,"","","","","","","",null,"","","","","","","",null,"","","","","","","",null,"","","","","","",""]
[49,null,null,null,null,null,null,null,null,null,null,null,"","","","","",{"$f":"IF(C51=\"\",\"\",IF(ISNUMBER(SEARCH(\"Start&End\",B51)),SUM(P51:INDEX(P51:P155,MATCH(TRUE,(B51:B155=\"Start&End\"),0))),SUM(P51:INDEX(P51:P155,MATCH(TRUE,(B51:B155=\"End\"),0)))))","v":""},{"$f":"IF(C51=\"\",\"\",IF(ISNUMBER(SEARCH(\"Start&End\",B51)),SUM(Q51:INDEX(Q51:Q155,MATCH(TRUE,(B51:B155=\"Start&End\"),0))),SUM(Q51:INDEX(Q51:Q155,MATCH(TRUE,(B51:B155=\"End\"),0)))))","v":""},"",null,null,null,null,null,null,"","","","","","","","",null,"","","","","","","",null,"","","","","","","",null,"","","","","","","",null,"","","","","","",""]
[50,null,null,null,null,null,null,null,null,null,null,null,"","","","","",{"$f":"IF(C52=\"\",\"\",IF(ISNUMBER(SEARCH(\"Start&End\",B52)),SUM(P52:INDEX(P52:P156,MATCH(TRUE,(B52:B156=\"Start&End\"),0))),SUM(P52:INDEX(P52:P156,MATCH(TRUE,(B52:B156=\"End\"),0)))))","v":""},{"$f":"IF(C52=\"\",\"\",IF(ISNUMBER(SEARCH(\"Start&End\",B52)),SUM(Q52:INDEX(Q52:Q156,MATCH(TRUE,(B52:B156=\"Start&End\"),0))),SUM(Q52:INDEX(Q52:Q156,MATCH(TRUE,(B52:B156=\"End\"),0)))))","v":""},"",null,null,null,null,null,null,"","","","","","","","",null,"","","","","","","",null,"","","","","","","",null,"","","","","","","",null,"","","","","","",""]
[51,null,null,null,null,null,null,null,null,null,null,null,"","","","","",{"$f":"IF(C53=\"\",\"\",IF(ISNUMBER(SEARCH(\"Start&End\",B53)),SUM(P53:INDEX(P53:P157,MATCH(TRUE,(B53:B157=\"Start&End\"),0))),SUM(P53:INDEX(P53:P157,MATCH(TRUE,(B53:B157=\"End\"),0)))))","v":""},{"$f":"IF(C53=\"\",\"\",IF(ISNUMBER(SEARCH(\"Start&End\",B53)),SUM(Q53:INDEX(Q53:Q157,MATCH(TRUE,(B53:B157=\"Start&End\"),0))),SUM(Q53:INDEX(Q53:Q157,MATCH(TRUE,(B53:B157=\"End\"),0)))))","v":""},"",null,null,null,null,null,null,"","","","","","","","",null,"","","","","","","",null,"","","","","","","",null,"","","","","","","",null,"","","","","","",""]
[52,null,null,null,null,null,null,null,null,null,null,null,"","","","","",{"$f":"IF(C54=\"\",\"\",IF(ISNUMBER(SEARCH(\"Start&End\",B54)),SUM(P54:INDEX(P54:P158,MATCH(TRUE,(B54:B158=\"Start&End\"),0))),SUM(P54:INDEX(P54:P158,MATCH(TRUE,(B54:B158=\"End\"),0)))))","v":""},{"$f":"IF(C54=\"\",\"\",IF(ISNUMBER(SEARCH(\"Start&End\",B54)),SUM(Q54:INDEX(Q54:Q158,MATCH(TRUE,(B54:B158=\"Start&End\"),0))),SUM(Q54:INDEX(Q54:Q158,MATCH(TRUE,(B54:B158=\"End\"),0)))))","v":""},"",null,null,null,null,null,null,"","","","","","","","",null,"","","","","","","",null,"","","","","","","",null,"","","","","","","",null,"","","","","","",""]
[53,null,null,null,null,null,null,null,null,null,null,null,"","","","","",{"$f":"IF(C55=\"\",\"\",IF(ISNUMBER(SEARCH(\"Start&End\",B55)),SUM(P55:INDEX(P55:P159,MATCH(TRUE,(B55:B159=\"Start&End\"),0))),SUM(P55:INDEX(P55:P159,MATCH(TRUE,(B55:B159=\"End\"),0)))))","v":""},{"$f":"IF(C55=\"\",\"\",IF(ISNUMBER(SEARCH(\"Start&End\",B55)),SUM(Q55:INDEX(Q55:Q159,MATCH(TRUE,(B55:B159=\"Start&End\"),0))),SUM(Q55:INDEX(Q55:Q159,MATCH(TRUE,(B55:B159=\"End\"),0)))))","v":""},"",null,null,null,null,null,null,"","","","","","","","",null,"","","","","","","",null,"","","","","","","",null,"","","","","","","",null,"","","","","","",""]
[54,null,null,null,null,null,null,null,null,null,null,null,"","","","","",{"$f":"IF(C56=\"\",\"\",IF(ISNUMBER(SEARCH(\"Start&End\",B56)),SUM(P56:INDEX(P56:P160,MATCH(TRUE,(B56:B160=\"Start&End\"),0))),SUM(P56:INDEX(P56:P160,MATCH(TRUE,(B56:B160=\"End\"),0)))))","v":""},{"$f":"IF(C56=\"\",\"\",IF(ISNUMBER(SEARCH(\"Start&End\",B56)),SUM(Q56:INDEX(Q56:Q160,MATCH(TRUE,(B56:B160=\"Start&End\"),0))),SUM(Q56:INDEX(Q56:Q160,MATCH(TRUE,(B56:B160=\"End\"),0)))))","v":""},"",null,null,null,null,null,null,"","","","","","","","",null,"","","","","","","",null,"","","","","","","",null,"","","","","","","",null,"","","","","","",""]
[55,null,null,null,null,null,null,null,null,null,null,null,"","","","","",{"$f":"IF(C57=\"\",\"\",IF(ISNUMBER(SEARCH(\"Start&End\",B57)),SUM(P57:INDEX(P57:P161,MATCH(TRUE,(B57:B161=\"Start&End\"),0))),SUM(P57:INDEX(P57:P161,MATCH(TRUE,(B57:B161=\"End\"),0)))))","v":""},{"$f":"IF(C57=\"\",\"\",IF(ISNUMBER(SEARCH(\"Start&End\",B57)),SUM(Q57:INDEX(Q57:Q161,MATCH(TRUE,(B57:B161=\"Start&End\"),0))),SUM(Q57:INDEX(Q57:Q161,MATCH(TRUE,(B57:B161=\"End\"),0)))))","v":""},"",null,null,null,null,null,null,"","","","","","","","",null,"","","","","","","",null,"","","","","","","",null,"","","","","","","",null,"","","","","","",""]
[56,null,null,null,null,null,null,null,null,null,null,null,"","","","","",{"$f":"IF(C58=\"\",\"\",IF(ISNUMBER(SEARCH(\"Start&End\",B58)),SUM(P58:INDEX(P58:P162,MATCH(TRUE,(B58:B162=\"Start&End\"),0))),SUM(P58:INDEX(P58:P162,MATCH(TRUE,(B58:B162=\"End\"),0)))))","v":""},{"$f":"IF(C58=\"\",\"\",IF(ISNUMBER(SEARCH(\"Start&End\",B58)),SUM(Q58:INDEX(Q58:Q162,MATCH(TRUE,(B58:B162=\"Start&End\"),0))),SUM(Q58:INDEX(Q58:Q162,MATCH(TRUE,(B58:B162=\"End\"),0)))))","v":""},"",null,null,null,null,null,null,"","","","","","","","",null,"","","","","","","",null,"","","","","","","",null,"","","","","","","",null,"","","","","","",""]
[57,null,null,null,null,null,null,null,null,null,null,null,"","","","","",{"$f":"IF(C59=\"\",\"\",IF(ISNUMBER(SEARCH(\"Start&End\",B59)),SUM(P59:INDEX(P59:P163,MATCH(TRUE,(B59:B163=\"Start&End\"),0))),SUM(P59:INDEX(P59:P163,MATCH(TRUE,(B59:B163=\"End\"),0)))))","v":""},{"$f":"IF(C59=\"\",\"\",IF(ISNUMBER(SEARCH(\"Start&End\",B59)),SUM(Q59:INDEX(Q59:Q163,MATCH(TRUE,(B59:B163=\"Start&End\"),0))),SUM(Q59:INDEX(Q59:Q163,MATCH(TRUE,(B59:B163=\"End\"),0)))))","v":""},"",null,null,null,null,null,null,"","","","","","","","",null,"","","","","","","",null,"","","","","","","",null,"","","","","","","",null,"","","","","","",""]
[58,null,null,null,null,null,null,null,null,null,null,null,"","","","","",{"$f":"IF(C60=\"\",\"\",IF(ISNUMBER(SEARCH(\"Start&End\",B60)),SUM(P60:INDEX(P60:P164,MATCH(TRUE,(B60:B164=\"Start&End\"),0))),SUM(P60:INDEX(P60:P164,MATCH(TRUE,(B60:B164=\"End\"),0)))))","v":""},{"$f":"IF(C60=\"\",\"\",IF(ISNUMBER(SEARCH(\"Start&End\",B60)),SUM(Q60:INDEX(Q60:Q164,MATCH(TRUE,(B60:B164=\"Start&End\"),0))),SUM(Q60:INDEX(Q60:Q164,MATCH(TRUE,(B60:B164=\"End\"),0)))))","v":""},"",null,null,null,null,null,null,"","","","","","","","",null,"","","","","","","",null,"","","","","","","",null,"","","","","","","",null,"","","","","","",""]
[59,null,null,null,null,null,null,null,null,null,null,null,"","","","","",{"$f":"IF(C61=\"\",\"\",IF(ISNUMBER(SEARCH(\"Start&End\",B61)),SUM(P61:INDEX(P61:P165,MATCH(TRUE,(B61:B165=\"Start&End\"),0))),SUM(P61:INDEX(P61:P165,MATCH(TRUE,(B61:B165=\"End\"),0)))))","v":""},{"$f":"IF(C61=\"\",\"\",IF(ISNUMBER(SEARCH(\"Start&End\",B61)),SUM(Q61:INDEX(Q61:Q165,MATCH(TRUE,(B61:B165=\"Start&End\"),0))),SUM(Q61:INDEX(Q61:Q165,MATCH(TRUE,(B61:B165=\"End\"),0)))))","v":""},"",null,null,null,null,null,null,"","","","","","","","",null,"","","","","","","",null,"","","","","","","",null,"","","","","","","",null,"","","","","","",""]
[60,null,null,null,null,null,null,null,null,null,null,null,"","","","","",{"$f":"IF(C62=\"\",\"\",IF(ISNUMBER(SEARCH(\"Start&End\",B62)),SUM(P62:INDEX(P62:P166,MATCH(TRUE,(B62:B166=\"Start&End\"),0))),SUM(P62:INDEX(P62:P166,MATCH(TRUE,(B62:B166=\"End\"),0)))))","v":""},{"$f":"IF(C62=\"\",\"\",IF(ISNUMBER(SEARCH(\"Start&End\",B62)),SUM(Q62:INDEX(Q62:Q166,MATCH(TRUE,(B62:B166=\"Start&End\"),0))),SUM(Q62:INDEX(Q62:Q166,MATCH(TRUE,(B62:B166=\"End\"),0)))))","v":""},"",null,null,null,null,null,null,"","","","","","","","",null,"","","","","","","",null,"","","","","","","",null,"","","","","","","",null,"","","","","","",""]
[61,null,null,null,null,null,null,null,null,null,null,null,"","","","","",{"$f":"IF(C63=\"\",\"\",IF(ISNUMBER(SEARCH(\"Start&End\",B63)),SUM(P63:INDEX(P63:P167,MATCH(TRUE,(B63:B167=\"Start&End\"),0))),SUM(P63:INDEX(P63:P167,MATCH(TRUE,(B63:B167=\"End\"),0)))))","v":""},{"$f":"IF(C63=\"\",\"\",IF(ISNUMBER(SEARCH(\"Start&End\",B63)),SUM(Q63:INDEX(Q63:Q167,MATCH(TRUE,(B63:B167=\"Start&End\"),0))),SUM(Q63:INDEX(Q63:Q167,MATCH(TRUE,(B63:B167=\"End\"),0)))))","v":""},"",null,null,null,null,null,null,"","","","","","","","",null,"","","","","","","",null,"","","","","","","",null,"","","","","","","",null,"","","","","","",""]
[62,null,null,null,null,null,null,null,null,null,null,null,"","","","","",{"$f":"IF(C64=\"\",\"\",IF(ISNUMBER(SEARCH(\"Start&End\",B64)),SUM(P64:INDEX(P64:P168,MATCH(TRUE,(B64:B168=\"Start&End\"),0))),SUM(P64:INDEX(P64:P168,MATCH(TRUE,(B64:B168=\"End\"),0)))))","v":""},{"$f":"IF(C64=\"\",\"\",IF(ISNUMBER(SEARCH(\"Start&End\",B64)),SUM(Q64:INDEX(Q64:Q168,MATCH(TRUE,(B64:B168=\"Start&End\"),0))),SUM(Q64:INDEX(Q64:Q168,MATCH(TRUE,(B64:B168=\"End\"),0)))))","v":""},"",null,null,null,null,null,null,"","","","","","","","",null,"","","","","","","",null,"","","","","","","",null,"","","","","","","",null,"","","","","","",""]
[63,null,null,null,null,null,null,null,null,null,null,null,"","","","","",{"$f":"IF(C65=\"\",\"\",IF(ISNUMBER(SEARCH(\"Start&End\",B65)),SUM(P65:INDEX(P65:P169,MATCH(TRUE,(B65:B169=\"Start&End\"),0))),SUM(P65:INDEX(P65:P169,MATCH(TRUE,(B65:B169=\"End\"),0)))))","v":""},{"$f":"IF(C65=\"\",\"\",IF(ISNUMBER(SEARCH(\"Start&End\",B65)),SUM(Q65:INDEX(Q65:Q169,MATCH(TRUE,(B65:B169=\"Start&End\"),0))),SUM(Q65:INDEX(Q65:Q169,MATCH(TRUE,(B65:B169=\"End\"),0)))))","v":""},"",null,null,null,null,null,null,"","","","","","","","",null,"","","","","","","",null,"","","","","","","",null,"","","","","","","",null,"","","","","","",""]
[64,null,null,null,null,null,null,null,null,null,null,null,"","","","","",{"$f":"IF(C66=\"\",\"\",IF(ISNUMBER(SEARCH(\"Start&End\",B66)),SUM(P66:INDEX(P66:P170,MATCH(TRUE,(B66:B170=\"Start&End\"),0))),SUM(P66:INDEX(P66:P170,MATCH(TRUE,(B66:B170=\"End\"),0)))))","v":""},{"$f":"IF(C66=\"\",\"\",IF(ISNUMBER(SEARCH(\"Start&End\",B66)),SUM(Q66:INDEX(Q66:Q170,MATCH(TRUE,(B66:B170=\"Start&End\"),0))),SUM(Q66:INDEX(Q66:Q170,MATCH(TRUE,(B66:B170=\"End\"),0)))))","v":""},"",null,null,null,null,null,null,"","","","","","","","",null,"","","","","","","",null,"","","","","","","",null,"","","","","","","",null,"","","","","","",""]
[65,null,null,null,null,null,null,null,null,null,null,null,"","","","",{"$f":"IF(AA67=\"\",\"\",O67-P67)","v":""},{"$f":"IF(C67=\"\",\"\",IF(ISNUMBER(SEARCH(\"Start&End\",B67)),SUM(P67:INDEX(P67:P171,MATCH(TRUE,(B67:B171=\"Start&End\"),0))),SUM(P67:INDEX(P67:P171,MATCH(TRUE,(B67:B171=\"End\"),0)))))","v":""},{"$f":"IF(C67=\"\",\"\",IF(ISNUMBER(SEARCH(\"Start&End\",B67)),SUM(Q67:INDEX(Q67:Q171,MATCH(TRUE,(B67:B171=\"Start&End\"),0))),SUM(Q67:INDEX(Q67:Q171,MATCH(TRUE,(B67:B171=\"End\"),0)))))","v":""},{"$f":"IF(ISNUMBER(S67),S67,\"\")","v":""},null,null,null,null,null,null,{"$f":"IF((H67+I67)*G67=0,\"\",(H67+I67)*G67)","v":""},{"$f":"IF(ISNUMBER(SEARCH(\"FUT\",E67)),AZ67,IF(ISNUMBER(SEARCH(\"OPT\",E67)),BH67,IF(ISNUMBER(SEARCH(\"HOLD\",E67)),AJ67,AR67)))","v":""},{"$f":"IF(ISNUMBER(SEARCH(\"HOLD\",E67)),AK67,IF(ISNUMBER(SEARCH(\"INTRA\",E67)),AS67,IF(ISNUMBER(SEARCH(\"FUT\",E67)),BA67,BI67)))","v":""},{"$f":"IF(ISNUMBER(SEARCH(\"HOLD\",E67)),AL67,IF(ISNUMBER(SEARCH(\"INTRA\",E67)),AT67,IF(ISNUMBER(SEARCH(\"FUT\",E67)),BB67,BJ67)))","v":""},{"$f":"IF(ISNUMBER(SEARCH(\"HOLD\",E67)),AM67,IF(ISNUMBER(SEARCH(\"INTRA\",E67)),AU67,IF(ISNUMBER(SEARCH(\"FUT\",E67)),BC67,BK67)))","v":""},{"$f":"IF(ISNUMBER(SEARCH(\"HOLD\",E67)),AN67,IF(ISNUMBER(SEARCH(\"INTRA\",E67)),AV67,IF(ISNUMBER(SEARCH(\"FUT\",E67)),BD67,BL67)))","v":""},{"$f":"IF(ISNUMBER(SEARCH(\"HOLD\",E67)),AO67,IF(ISNUMBER(SEARCH(\"INTRA\",E67)),AW67,IF(ISNUMBER(SEARCH(\"FUT\",E67)),BE67,BM67)))","v":""},"",null,"","","","","",{"$f":"IF(G67&H67=\"\",\"\",ROUND(G67*H67*0.00015,2))","v":""},"",null,{"$f":"IF(MIN(20,((G67*H67*0.0003)))+MIN(20,((G67*H67*0.0003)))=0,\"\",MIN(20,((G67*H67*0.0003)))+MIN(20,((G67*H67*0.0003))))","v":""},{"$f":"IF(I67&G67=\"\",\"\",ROUND(I67*G67*0.00025,0))","v":""},"","","",{"$f":"IF(G67&H67=\"\",\"\",ROUND(G67*H67*0.00003,2))","v":""},"",null,{"$f":"IF(MIN(20,((G67*H67*0.0003)))+MIN(20,((G67*H67*0.0003)))=0,\"\",MIN(20,((G67*H67*0.0003)))+MIN(20,((G67*H67*0.0003))))","v":""},{"$f":"IF(I67&G67=\"\",\"\",ROUND(I67*G67*0.0001,0))","v":""},"","","",{"$f":"IF(G67&H67=\"\",\"\",ROUND(G67*H67*0.00002,2))","v":""},"",null,{"$f":"IF(AA67=\"\",\"\",40)","v":""},{"$f":"IF(I67&G67=\"\",\"\",ROUND(I67*G67*0.0005,0))","v":""},{"$f":"IF(AA67=\"\",\"\",ROUND(AA67*0.00053,2))","v":""},"",{"$f":"IF(AA67=\"\",\"\",ROUND((5/10000000)*AA67,2))","v":""},{"$f":"IF(G67&H67=\"\",\"\",ROUND(G67*H67*0.00003,2))","v":""},""]
[66,null,null,null,null,null,null,null,null,null,null,null,{"$f":"IF(OR(J68=\"\",K68=\"\"),\"\",IF(F68=\"Long\",  ((K68-H68)/(H68-J68)), ((I68-K68)/(J68-I68)) ))","v":""},{"$f":"IF(OR(I68=\"\",D68=\"\",H68=\"\",G68=\"\",E68=\"\",K68=\"\"),\"\",IF(I68=K68,\"Target Achieved\",IF(I68=J68,\"SL Hit\",IF(I68<J68,\"Extended SL Hit\",IF(I68>K68,\"Target Overachieved\",IF(AND(I68>=H68,I68<K68),\"Early Profit Exit\",\"Early Loss Exit\"))))))","v":""},{"$f":"IF(AA68=\"\",\"\",IF(OR(I68=\"\",H68=\"\"),0,G68*(I68-H68)))","v":""},{"$f":"IF(AH68=\"\",\"\",AH68)","v":""},"",{"$f":"IF(C68=\"\",\"\",IF(ISNUMBER(SEARCH(\"Start&End\",B68)),SUM(P68:INDEX(P68:P172,MATCH(TRUE,(B68:B172=\"Start&End\"),0))),SUM(P68:INDEX(P68:P172,MATCH(TRUE,(B68:B172=\"End\"),0)))))","v":""},{"$f":"IF(C68=\"\",\"\",IF(ISNUMBER(SEARCH(\"Start&End\",B68)),SUM(Q68:INDEX(Q68:Q172,MATCH(TRUE,(B68:B172=\"Start&End\"),0))),SUM(Q68:INDEX(Q68:Q172,MATCH(TRUE,(B68:B172=\"End\"),0)))))","v":""},"",null,null,null,null,null,null,"","","","","","","",{"$f":"IF(AB68&AC68&AD68&AE68&AF68&AG68=\"\",\"\",SUM(AB68:AG68))","v":""},null,{"$f":"IF(AA68=\"\",\"\",0)","v":""},{"$f":"IF(AA68=\"\",\"\",ROUND(AA68*0.001,2))","v":""},{"$f":"IF(AA68=\"\",\"\",ROUND(AA68*0.0000345,2))","v":""},{"$f":"IF(AJ68&AL68=\"\",\"\",ROUND((AJ68+AL68)*0.18,2))","v":""},{"$f":"IF(AA68=\"\",\"\",ROUND((5/10000000)*AA68,2))","v":""},"",{"$f":"IF(AK68&AL68&AM68&AN68&AO68=\"\",\"\",SUM(AK68:AO68))","v":""},null,"","",{"$f":"IF(AA68=\"\",\"\",ROUND(AA68*0.0000345,2))","v":""},{"$f":"IF(AR68&AT68=\"\",\"\",ROUND((AR68+AT68)*0.18,2))","v":""},{"$f":"IF(AA68=\"\",\"\",ROUND((5/10000000)*AA68,2))","v":""},"",{"$f":"IF(AR68&AS68&AT68&AU68&AV68&AW68=\"\",\"\",SUM(AR68:AW68))","v":""},null,"","",{"$f":"IF(AA68=\"\",\"\",ROUND(AA68*0.00002,2))","v":""},{"$f":"IF(AZ68&BB68=\"\",\"\",ROUND((AZ68+BB68)*0.18,2))","v":""},{"$f":"IF(AA68=\"\",\"\",ROUND((5/10000000)*AA68,2))","v":""},"","",null,"","","",{"$f":"IF(BH68&BJ68=\"\",\"\",ROUND((BH68+BJ68)*0.18,2))","v":""},"","",{"$f":"IF(BH68&BI68&BJ68&BK68&BL68&BM68=\"\",\"\",SUM(BH68:BM68))","v":""}]
[67,null,null,null,null,null,null,null,null,null,null,null,"","","","","",{"$f":"IF(C69=\"\",\"\",IF(ISNUMBER(SEARCH(\"Start&End\",B69)),SUM(P69:INDEX(P69:P173,MATCH(TRUE,(B69:B173=\"Start&End\"),0))),SUM(P69:INDEX(P69:P173,MATCH(TRUE,(B69:B173=\"End\"),0)))))","v":""},{"$f":"IF(C69=\"\",\"\",IF(ISNUMBER(SEARCH(\"Start&End\",B69)),SUM(Q69:INDEX(Q69:Q173,MATCH(TRUE,(B69:B173=\"Start&End\"),0))),SUM(Q69:INDEX(Q69:Q173,MATCH(TRUE,(B69:B173=\"End\"),0)))))","v":""},"",null,null,null,null,null,null,"","","","","","","","",null,"","","","","","","",null,"","","","","","","",null,"","","","","","",{"$f":"IF(FAX69&BA69&BB69&BC69&BD69&BE69=\"\",\"\",SUM(AZ69:BE69))","v":""},null,"","","","","","",""]
[68,null,null,null,null,null,null,null,null,null,null,null,"","","","","",{"$f":"IF(C70=\"\",\"\",IF(ISNUMBER(SEARCH(\"Start&End\",B70)),SUM(P70:INDEX(P70:P174,MATCH(TRUE,(B70:B174=\"Start&End\"),0))),SUM(P70:INDEX(P70:P174,MATCH(TRUE,(B70:B174=\"End\"),0)))))","v":""},{"$f":"IF(C70=\"\",\"\",IF(ISNUMBER(SEARCH(\"Start&End\",B70)),SUM(Q70:INDEX(Q70:Q174,MATCH(TRUE,(B70:B174=\"Start&End\"),0))),SUM(Q70:INDEX(Q70:Q174,MATCH(TRUE,(B70:B174=\"End\"),0)))))","v":""},"",null,null,null,null,null,null,"","","","","","","","",null,"","","","","","","",null,"","","","","","","",null,"","","","","","","",null,"","","","","","",""]
[69,null,null,null,null,null,null,null,null,null,null,null,"","","","","",{"$f":"IF(C71=\"\",\"\",IF(ISNUMBER(SEARCH(\"Start&End\",B71)),SUM(P71:INDEX(P71:P175,MATCH(TRUE,(B71:B175=\"Start&End\"),0))),SUM(P71:INDEX(P71:P175,MATCH(TRUE,(B71:B175=\"End\"),0)))))","v":""},{"$f":"IF(C71=\"\",\"\",IF(ISNUMBER(SEARCH(\"Start&End\",B71)),SUM(Q71:INDEX(Q71:Q175,MATCH(TRUE,(B71:B175=\"Start&End\"),0))),SUM(Q71:INDEX(Q71:Q175,MATCH(TRUE,(B71:B175=\"End\"),0)))))","v":""},"",null,null,null,null,null,null,"","","","","","","","",null,"","","","","","","",null,"","","","","","","",null,"","","","","","","",null,"","","","","","",""]
[70,null,null,null,null,null,null,null,null,null,null,null,"","","","","",{"$f":"IF(C72=\"\",\"\",IF(ISNUMBER(SEARCH(\"Start&End\",B72)),SUM(P72:INDEX(P72:P176,MATCH(TRUE,(B72:B176=\"Start&End\"),0))),SUM(P72:INDEX(P72:P176,MATCH(TRUE,(B72:B176=\"End\"),0)))))","v":""},{"$f":"IF(C72=\"\",\"\",IF(ISNUMBER(SEARCH(\"Start&End\",B72)),SUM(Q72:INDEX(Q72:Q176,MATCH(TRUE,(B72:B176=\"Start&End\"),0))),SUM(Q72:INDEX(Q72:Q176,MATCH(TRUE,(B72:B176=\"End\"),0)))))","v":""},"",null,null,null,null,null,null,"","","","","","","","",null,"","","","","","","",null,"","","","","","","",null,"","","","","","","",null,"","","","","","",""]
[71,null,null,null,null,null,null,null,null,null,null,null,"","","","","",{"$f":"IF(C73=\"\",\"\",IF(ISNUMBER(SEARCH(\"Start&End\",B73)),SUM(P73:INDEX(P73:P177,MATCH(TRUE,(B73:B177=\"Start&End\"),0))),SUM(P73:INDEX(P73:P177,MATCH(TRUE,(B73:B177=\"End\"),0)))))","v":""},{"$f":"IF(C73=\"\",\"\",IF(ISNUMBER(SEARCH(\"Start&End\",B73)),SUM(Q73:INDEX(Q73:Q177,MATCH(TRUE,(B73:B177=\"Start&End\"),0))),SUM(Q73:INDEX(Q73:Q177,MATCH(TRUE,(B73:B177=\"End\"),0)))))","v":""},"",null,null,null,null,null,null,"","","","","","","","",null,"","","","","","","",null,"","","","","","","",null,"","","","","","","",null,"","","","","","",""]
[72,null,null,null,null,null,null,null,null,null,null,null,"","","","","",{"$f":"IF(C74=\"\",\"\",IF(ISNUMBER(SEARCH(\"Start&End\",B74)),SUM(P74:INDEX(P74:P178,MATCH(TRUE,(B74:B178=\"Start&End\"),0))),SUM(P74:INDEX(P74:P178,MATCH(TRUE,(B74:B178=\"End\"),0)))))","v":""},{"$f":"IF(C74=\"\",\"\",IF(ISNUMBER(SEARCH(\"Start&End\",B74)),SUM(Q74:INDEX(Q74:Q178,MATCH(TRUE,(B74:B178=\"Start&End\"),0))),SUM(Q74:INDEX(Q74:Q178,MATCH(TRUE,(B74:B178=\"End\"),0)))))","v":""},"",null,null,null,null,null,null,"","","","","","","","",null,"","","","","","","",null,"","","","","","","",null,"","","","","","","",null,"","","","","","",""]
[73,null,null,null,null,null,null,null,null,null,null,null,"","","","","",{"$f":"IF(C75=\"\",\"\",IF(ISNUMBER(SEARCH(\"Start&End\",B75)),SUM(P75:INDEX(P75:P179,MATCH(TRUE,(B75:B179=\"Start&End\"),0))),SUM(P75:INDEX(P75:P179,MATCH(TRUE,(B75:B179=\"End\"),0)))))","v":""},{"$f":"IF(C75=\"\",\"\",IF(ISNUMBER(SEARCH(\"Start&End\",B75)),SUM(Q75:INDEX(Q75:Q179,MATCH(TRUE,(B75:B179=\"Start&End\"),0))),SUM(Q75:INDEX(Q75:Q179,MATCH(TRUE,(B75:B179=\"End\"),0)))))","v":""},"",null,null,null,null,null,null,"","","","","","","","",null,"","","","","","","",null,"","","","","","","",null,"","","","","","","",null,"","","","","","",""]
[74,null,null,null,null,null,null,null,null,null,null,null,"","","","","",{"$f":"IF(C76=\"\",\"\",IF(ISNUMBER(SEARCH(\"Start&End\",B76)),SUM(P76:INDEX(P76:P180,MATCH(TRUE,(B76:B180=\"Start&End\"),0))),SUM(P76:INDEX(P76:P180,MATCH(TRUE,(B76:B180=\"End\"),0)))))","v":""},{"$f":"IF(C76=\"\",\"\",IF(ISNUMBER(SEARCH(\"Start&End\",B76)),SUM(Q76:INDEX(Q76:Q180,MATCH(TRUE,(B76:B180=\"Start&End\"),0))),SUM(Q76:INDEX(Q76:Q180,MATCH(TRUE,(B76:B180=\"End\"),0)))))","v":""},"",null,null,null,null,null,null,"","","","","","","","",null,"","","","","","","",null,"","","","","","","",null,"","","","","","","",null,"","","","","","",""]
[75,null,null,null,null,null,null,null,null,null,null,null,"","","","","",{"$f":"IF(C77=\"\",\"\",IF(ISNUMBER(SEARCH(\"Start&End\",B77)),SUM(P77:INDEX(P77:P181,MATCH(TRUE,(B77:B181=\"Start&End\"),0))),SUM(P77:INDEX(P77:P181,MATCH(TRUE,(B77:B181=\"End\"),0)))))","v":""},{"$f":"IF(C77=\"\",\"\",IF(ISNUMBER(SEARCH(\"Start&End\",B77)),SUM(Q77:INDEX(Q77:Q181,MATCH(TRUE,(B77:B181=\"Start&End\"),0))),SUM(Q77:INDEX(Q77:Q181,MATCH(TRUE,(B77:B181=\"End\"),0)))))","v":""},"",null,null,null,null,null,null,"","","","","","","","",null,"","","","","","","",null,"","","","","","","",null,"","","","","","","",null,"","","","","","",""]
[76,null,null,null,null,null,null,null,null,null,null,null,"","","","","",{"$f":"IF(C78=\"\",\"\",IF(ISNUMBER(SEARCH(\"Start&End\",B78)),SUM(P78:INDEX(P78:P182,MATCH(TRUE,(B78:B182=\"Start&End\"),0))),SUM(P78:INDEX(P78:P182,MATCH(TRUE,(B78:B182=\"End\"),0)))))","v":""},{"$f":"IF(C78=\"\",\"\",IF(ISNUMBER(SEARCH(\"Start&End\",B78)),SUM(Q78:INDEX(Q78:Q182,MATCH(TRUE,(B78:B182=\"Start&End\"),0))),SUM(Q78:INDEX(Q78:Q182,MATCH(TRUE,(B78:B182=\"End\"),0)))))","v":""},"",null,null,null,null,null,null,"","","","","","","","",null,"","","","","","","",null,"","","","","","","",null,"","","","","","","",null,"","","","","","",""]
[77,null,null,null,null,null,null,null,null,null,null,null,"","","","","",{"$f":"IF(C79=\"\",\"\",IF(ISNUMBER(SEARCH(\"Start&End\",B79)),SUM(P79:INDEX(P79:P183,MATCH(TRUE,(B79:B183=\"Start&End\"),0))),SUM(P79:INDEX(P79:P183,MATCH(TRUE,(B79:B183=\"End\"),0)))))","v":""},{"$f":"IF(C79=\"\",\"\",IF(ISNUMBER(SEARCH(\"Start&End\",B79)),SUM(Q79:INDEX(Q79:Q183,MATCH(TRUE,(B79:B183=\"Start&End\"),0))),SUM(Q79:INDEX(Q79:Q183,MATCH(TRUE,(B79:B183=\"End\"),0)))))","v":""},"",null,null,null,null,null,null,"","","","","","","","",null,"","","","","","","",null,"","","","","","","",null,"","","","","","","",null,"","","","","","",""]
[78,null,null,null,null,null,null,null,null,null,null,null,"","","","","",{"$f":"IF(C80=\"\",\"\",IF(ISNUMBER(SEARCH(\"Start&End\",B80)),SUM(P80:INDEX(P80:P184,MATCH(TRUE,(B80:B184=\"Start&End\"),0))),SUM(P80:INDEX(P80:P184,MATCH(TRUE,(B80:B184=\"End\"),0)))))","v":""},{"$f":"IF(C80=\"\",\"\",IF(ISNUMBER(SEARCH(\"Start&End\",B80)),SUM(Q80:INDEX(Q80:Q184,MATCH(TRUE,(B80:B184=\"Start&End\"),0))),SUM(Q80:INDEX(Q80:Q184,MATCH(TRUE,(B80:B184=\"End\"),0)))))","v":""},"",null,null,null,null,null,null,"","","","","","","","",null,"","","","","","","",null,"","","","","","","",null,"","","","","","","",null,"","","","","","",""]
[79,null,null,null,null,null,null,null,null,null,null,null,"","","","","",{"$f":"IF(C81=\"\",\"\",IF(ISNUMBER(SEARCH(\"Start&End\",B81)),SUM(P81:INDEX(P81:P185,MATCH(TRUE,(B81:B185=\"Start&End\"),0))),SUM(P81:INDEX(P81:P185,MATCH(TRUE,(B81:B185=\"End\"),0)))))","v":""},{"$f":"IF(C81=\"\",\"\",IF(ISNUMBER(SEARCH(\"Start&End\",B81)),SUM(Q81:INDEX(Q81:Q185,MATCH(TRUE,(B81:B185=\"Start&End\"),0))),SUM(Q81:INDEX(Q81:Q185,MATCH(TRUE,(B81:B185=\"End\"),0)))))","v":""},"",null,null,null,null,null,null,"","","","","","","","",null,"","","","","","","",null,"","","","","","","",null,"","","","","","","",null,"","","","","","",""]
[80,null,null,null,null,null,null,null,null,null,null,null,"","","","","",{"$f":"IF(C82=\"\",\"\",IF(ISNUMBER(SEARCH(\"Start&End\",B82)),SUM(P82:INDEX(P82:P186,MATCH(TRUE,(B82:B186=\"Start&End\"),0))),SUM(P82:INDEX(P82:P186,MATCH(TRUE,(B82:B186=\"End\"),0)))))","v":""},{"$f":"IF(C82=\"\",\"\",IF(ISNUMBER(SEARCH(\"Start&End\",B82)),SUM(Q82:INDEX(Q82:Q186,MATCH(TRUE,(B82:B186=\"Start&End\"),0))),SUM(Q82:INDEX(Q82:Q186,MATCH(TRUE,(B82:B186=\"End\"),0)))))","v":""},"",null,null,null,null,null,null,"","","","","","","","",null,"","","","","","","",null,"","","","","","","",null,"","","","","","","",null,"","","","","","",""]
[81,null,null,null,null,null,null,null,null,null,null,null,"","","","","",{"$f":"IF(C83=\"\",\"\",IF(ISNUMBER(SEARCH(\"Start&End\",B83)),SUM(P83:INDEX(P83:P187,MATCH(TRUE,(B83:B187=\"Start&End\"),0))),SUM(P83:INDEX(P83:P187,MATCH(TRUE,(B83:B187=\"End\"),0)))))","v":""},{"$f":"IF(C83=\"\",\"\",IF(ISNUMBER(SEARCH(\"Start&End\",B83)),SUM(Q83:INDEX(Q83:Q187,MATCH(TRUE,(B83:B187=\"Start&End\"),0))),SUM(Q83:INDEX(Q83:Q187,MATCH(TRUE,(B83:B187=\"End\"),0)))))","v":""},"",null,null,null,null,null,null,"","","","","","","","",null,"","","","","","","",null,"","","","","","","",null,"","","","","","","",null,"","","","","","",""]
[82,null,null,null,null,null,null,null,null,null,null,null,"","","","","",{"$f":"IF(C84=\"\",\"\",IF(ISNUMBER(SEARCH(\"Start&End\",B84)),SUM(P84:INDEX(P84:P188,MATCH(TRUE,(B84:B188=\"Start&End\"),0))),SUM(P84:INDEX(P84:P188,MATCH(TRUE,(B84:B188=\"End\"),0)))))","v":""},{"$f":"IF(C84=\"\",\"\",IF(ISNUMBER(SEARCH(\"Start&End\",B84)),SUM(Q84:INDEX(Q84:Q188,MATCH(TRUE,(B84:B188=\"Start&End\"),0))),SUM(Q84:INDEX(Q84:Q188,MATCH(TRUE,(B84:B188=\"End\"),0)))))","v":""},"",null,null,null,null,null,null,"","","","","","","","",null,"","","","","","","",null,"","","","","","","",null,"","","","","","","",null,"","","","","","",""]
[83,null,null,null,null,null,null,null,null,null,null,null,"","","","","",{"$f":"IF(C85=\"\",\"\",IF(ISNUMBER(SEARCH(\"Start&End\",B85)),SUM(P85:INDEX(P85:P189,MATCH(TRUE,(B85:B189=\"Start&End\"),0))),SUM(P85:INDEX(P85:P189,MATCH(TRUE,(B85:B189=\"End\"),0)))))","v":""},{"$f":"IF(C85=\"\",\"\",IF(ISNUMBER(SEARCH(\"Start&End\",B85)),SUM(Q85:INDEX(Q85:Q189,MATCH(TRUE,(B85:B189=\"Start&End\"),0))),SUM(Q85:INDEX(Q85:Q189,MATCH(TRUE,(B85:B189=\"End\"),0)))))","v":""},"",null,null,null,null,null,null,"","","","","","","","",null,"","","","","","","",null,"","","","","","","",null,"","","","","","","",null,"","","","","","",""]
[84,null,null,null,null,null,null,null,null,null,null,null,"","","","","",{"$f":"IF(C86=\"\",\"\",IF(ISNUMBER(SEARCH(\"Start&End\",B86)),SUM(P86:INDEX(P86:P190,MATCH(TRUE,(B86:B190=\"Start&End\"),0))),SUM(P86:INDEX(P86:P190,MATCH(TRUE,(B86:B190=\"End\"),0)))))","v":""},{"$f":"IF(C86=\"\",\"\",IF(ISNUMBER(SEARCH(\"Start&End\",B86)),SUM(Q86:INDEX(Q86:Q190,MATCH(TRUE,(B86:B190=\"Start&End\"),0))),SUM(Q86:INDEX(Q86:Q190,MATCH(TRUE,(B86:B190=\"End\"),0)))))","v":""},"",null,null,null,null,null,null,"","","","","","","","",null,"","","","","","","",null,"","","","","","","",null,"","","","","","","",null,"","","","","","",""]
[85,null,null,null,null,null,null,null,null,null,null,null,"","","","","",{"$f":"IF(C87=\"\",\"\",IF(ISNUMBER(SEARCH(\"Start&End\",B87)),SUM(P87:INDEX(P87:P191,MATCH(TRUE,(B87:B191=\"Start&End\"),0))),SUM(P87:INDEX(P87:P191,MATCH(TRUE,(B87:B191=\"End\"),0)))))","v":""},{"$f":"IF(C87=\"\",\"\",IF(ISNUMBER(SEARCH(\"Start&End\",B87)),SUM(Q87:INDEX(Q87:Q191,MATCH(TRUE,(B87:B191=\"Start&End\"),0))),SUM(Q87:INDEX(Q87:Q191,MATCH(TRUE,(B87:B191=\"End\"),0)))))","v":""},"",null,null,null,null,null,null,"","","","","","","","",null,"","","","","","","",null,"","","","","","","",null,"","","","","","","",null,"","","","","","",""]
[86,null,null,null,null,null,null,null,null,null,null,null,"","","","","",{"$f":"IF(C88=\"\",\"\",IF(ISNUMBER(SEARCH(\"Start&End\",B88)),SUM(P88:INDEX(P88:P192,MATCH(TRUE,(B88:B192=\"Start&End\"),0))),SUM(P88:INDEX(P88:P192,MATCH(TRUE,(B88:B192=\"End\"),0)))))","v":""},{"$f":"IF(C88=\"\",\"\",IF(ISNUMBER(SEARCH(\"Start&End\",B88)),SUM(Q88:INDEX(Q88:Q192,MATCH(TRUE,(B88:B192=\"Start&End\"),0))),SUM(Q88:INDEX(Q88:Q192,MATCH(TRUE,(B88:B192=\"End\"),0)))))","v":""},"",null,null,null,null,null,null,"","","","","","","","",null,"","","","","","","",null,"","","","","","","",null,"","","","","","","",null,"","","","","","",""]
[87,null,null,null,null,null,null,null,null,null,null,null,"","","","","",{"$f":"IF(C89=\"\",\"\",IF(ISNUMBER(SEARCH(\"Start&End\",B89)),SUM(P89:INDEX(P89:P193,MATCH(TRUE,(B89:B193=\"Start&End\"),0))),SUM(P89:INDEX(P89:P193,MATCH(TRUE,(B89:B193=\"End\"),0)))))","v":""},{"$f":"IF(C89=\"\",\"\",IF(ISNUMBER(SEARCH(\"Start&End\",B89)),SUM(Q89:INDEX(Q89:Q193,MATCH(TRUE,(B89:B193=\"Start&End\"),0))),SUM(Q89:INDEX(Q89:Q193,MATCH(TRUE,(B89:B193=\"End\"),0)))))","v":""},"",null,null,null,null,null,null,"","","","","","","","",null,"","","","","","","",null,"","","","","","","",null,"","","","","","","",null,"","","","","","",""]
[88,null,null,null,null,null,null,null,null,null,null,null,"","","","","",{"$f":"IF(C90=\"\",\"\",IF(ISNUMBER(SEARCH(\"Start&End\",B90)),SUM(P90:INDEX(P90:P194,MATCH(TRUE,(B90:B194=\"Start&End\"),0))),SUM(P90:INDEX(P90:P194,MATCH(TRUE,(B90:B194=\"End\"),0)))))","v":""},{"$f":"IF(C90=\"\",\"\",IF(ISNUMBER(SEARCH(\"Start&End\",B90)),SUM(Q90:INDEX(Q90:Q194,MATCH(TRUE,(B90:B194=\"Start&End\"),0))),SUM(Q90:INDEX(Q90:Q194,MATCH(TRUE,(B90:B194=\"End\"),0)))))","v":""},"",null,null,null,null,null,null,"","","","","","","","",null,"","","","","","","",null,"","","","","","","",null,"","","","","","","",null,"","","","","","",""]
[89,null,null,null,null,null,null,null,null,null,null,null,"","","","","",{"$f":"IF(C91=\"\",\"\",IF(ISNUMBER(SEARCH(\"Start&End\",B91)),SUM(P91:INDEX(P91:P195,MATCH(TRUE,(B91:B195=\"Start&End\"),0))),SUM(P91:INDEX(P91:P195,MATCH(TRUE,(B91:B195=\"End\"),0)))))","v":""},{"$f":"IF(C91=\"\",\"\",IF(ISNUMBER(SEARCH(\"Start&End\",B91)),SUM(Q91:INDEX(Q91:Q195,MATCH(TRUE,(B91:B195=\"Start&End\"),0))),SUM(Q91:INDEX(Q91:Q195,MATCH(TRUE,(B91:B195=\"End\"),0)))))","v":""},"",null,null,null,null,null,null,"","","","","","","","",null,"","","","","","","",null,"","","","","","","",null,"","","","","","","",null,"","","","","","",""]
[90,null,null,null,null,null,null,null,null,null,null,null,"","","","","",{"$f":"IF(C92=\"\",\"\",IF(ISNUMBER(SEARCH(\"Start&End\",B92)),SUM(P92:INDEX(P92:P196,MATCH(TRUE,(B92:B196=\"Start&End\"),0))),SUM(P92:INDEX(P92:P196,MATCH(TRUE,(B92:B196=\"End\"),0)))))","v":""},{"$f":"IF(C92=\"\",\"\",IF(ISNUMBER(SEARCH(\"Start&End\",B92)),SUM(Q92:INDEX(Q92:Q196,MATCH(TRUE,(B92:B196=\"Start&End\"),0))),SUM(Q92:INDEX(Q92:Q196,MATCH(TRUE,(B92:B196=\"End\"),0)))))","v":""},"",null,null,null,null,null,null,"","","","","","","","",null,"","","","","","","",null,"","","","","","","",null,"","","","","","","",null,"","","","","","",""]
[91,null,null,null,null,null,null,null,null,null,null,null,"","","","","",{"$f":"IF(C93=\"\",\"\",IF(ISNUMBER(SEARCH(\"Start&End\",B93)),SUM(P93:INDEX(P93:P197,MATCH(TRUE,(B93:B197=\"Start&End\"),0))),SUM(P93:INDEX(P93:P197,MATCH(TRUE,(B93:B197=\"End\"),0)))))","v":""},{"$f":"IF(C93=\"\",\"\",IF(ISNUMBER(SEARCH(\"Start&End\",B93)),SUM(Q93:INDEX(Q93:Q197,MATCH(TRUE,(B93:B197=\"Start&End\"),0))),SUM(Q93:INDEX(Q93:Q197,MATCH(TRUE,(B93:B197=\"End\"),0)))))","v":""},"",null,null,null,null,null,null,"","","","","","","","",null,"","","","","","","",null,"","","","","","","",null,"","","","","","","",null,"","","","","","",""]
[92,null,null,null,null,null,null,null,null,null,null,null,"","","","","",{"$f":"IF(C94=\"\",\"\",IF(ISNUMBER(SEARCH(\"Start&End\",B94)),SUM(P94:INDEX(P94:P198,MATCH(TRUE,(B94:B198=\"Start&End\"),0))),SUM(P94:INDEX(P94:P198,MATCH(TRUE,(B94:B198=\"End\"),0)))))","v":""},{"$f":"IF(C94=\"\",\"\",IF(ISNUMBER(SEARCH(\"Start&End\",B94)),SUM(Q94:INDEX(Q94:Q198,MATCH(TRUE,(B94:B198=\"Start&End\"),0))),SUM(Q94:INDEX(Q94:Q198,MATCH(TRUE,(B94:B198=\"End\"),0)))))","v":""},"",null,null,null,null,null,null,"","","","","","","","",null,"","","","","","","",null,"","","","","","","",null,"","","","","","","",null,"","","","","","",""]
[93,null,null,null,null,null,null,null,null,null,null,null,"","","","","",{"$f":"IF(C95=\"\",\"\",IF(ISNUMBER(SEARCH(\"Start&End\",B95)),SUM(P95:INDEX(P95:P199,MATCH(TRUE,(B95:B199=\"Start&End\"),0))),SUM(P95:INDEX(P95:P199,MATCH(TRUE,(B95:B199=\"End\"),0)))))","v":""},{"$f":"IF(C95=\"\",\"\",IF(ISNUMBER(SEARCH(\"Start&End\",B95)),SUM(Q95:INDEX(Q95:Q199,MATCH(TRUE,(B95:B199=\"Start&End\"),0))),SUM(Q95:INDEX(Q95:Q199,MATCH(TRUE,(B95:B199=\"End\"),0)))))","v":""},"",null,null,null,null,null,null,"","","","","","","","",null,"","","","","","","",null,"","","","","","","",null,"","","","","","","",null,"","","","","","",""]
[94,null,null,null,null,null,null,null,null,null,null,null,"","","","","",{"$f":"IF(C96=\"\",\"\",IF(ISNUMBER(SEARCH(\"Start&End\",B96)),SUM(P96:INDEX(P96:P200,MATCH(TRUE,(B96:B200=\"Start&End\"),0))),SUM(P96:INDEX(P96:P200,MATCH(TRUE,(B96:B200=\"End\"),0)))))","v":""},{"$f":"IF(C96=\"\",\"\",IF(ISNUMBER(SEARCH(\"Start&End\",B96)),SUM(Q96:INDEX(Q96:Q200,MATCH(TRUE,(B96:B200=\"Start&End\"),0))),SUM(Q96:INDEX(Q96:Q200,MATCH(TRUE,(B96:B200=\"End\"),0)))))","v":""},"",null,null,null,null,null,null,"","","","","","","","",null,"","","","","","","",null,"","","","","","","",null,"","","","","","","",null,"","","","","","",""]
[95,null,null,null,null,null,null,null,null,null,null,null,"","","","","",{"$f":"IF(C97=\"\",\"\",IF(ISNUMBER(SEARCH(\"Start&End\",B97)),SUM(P97:INDEX(P97:P201,MATCH(TRUE,(B97:B201=\"Start&End\"),0))),SUM(P97:INDEX(P97:P201,MATCH(TRUE,(B97:B201=\"End\"),0)))))","v":""},{"$f":"IF(C97=\"\",\"\",IF(ISNUMBER(SEARCH(\"Start&End\",B97)),SUM(Q97:INDEX(Q97:Q201,MATCH(TRUE,(B97:B201=\"Start&End\"),0))),SUM(Q97:INDEX(Q97:Q201,MATCH(TRUE,(B97:B201=\"End\"),0)))))","v":""},"",null,null,null,null,null,null,"","","","","","","","",null,"","","","","","","",null,"","","","","","","",null,"","","","","","","",null,"","","","","","",""]
[96,null,null,null,null,null,null,null,null,null,null,null,"","","","","",{"$f":"IF(C98=\"\",\"\",IF(ISNUMBER(SEARCH(\"Start&End\",B98)),SUM(P98:INDEX(P98:P202,MATCH(TRUE,(B98:B202=\"Start&End\"),0))),SUM(P98:INDEX(P98:P202,MATCH(TRUE,(B98:B202=\"End\"),0)))))","v":""},{"$f":"IF(C98=\"\",\"\",IF(ISNUMBER(SEARCH(\"Start&End\",B98)),SUM(Q98:INDEX(Q98:Q202,MATCH(TRUE,(B98:B202=\"Start&End\"),0))),SUM(Q98:INDEX(Q98:Q202,MATCH(TRUE,(B98:B202=\"End\"),0)))))","v":""},"",null,null,null,null,null,null,"","","","","","","","",null,"","","","","","","",null,"","","","","","","",null,"","","","","","","",null,"","","","","","",""]
[97,null,null,null,null,null,null,null,null,null,null,null,"","","","","",{"$f":"IF(C99=\"\",\"\",IF(ISNUMBER(SEARCH(\"Start&End\",B99)),SUM(P99:INDEX(P99:P203,MATCH(TRUE,(B99:B203=\"Start&End\"),0))),SUM(P99:INDEX(P99:P203,MATCH(TRUE,(B99:B203=\"End\"),0)))))","v":""},{"$f":"IF(C99=\"\",\"\",IF(ISNUMBER(SEARCH(\"Start&End\",B99)),SUM(Q99:INDEX(Q99:Q203,MATCH(TRUE,(B99:B203=\"Start&End\"),0))),SUM(Q99:INDEX(Q99:Q203,MATCH(TRUE,(B99:B203=\"End\"),0)))))","v":""},"",null,null,null,null,null,null,"","","","","","","","",null,"","","","","","","",null,"","","","","","","",null,"","","","","","","",null,"","","","","","",""]
[98,null,null,null,null,null,null,null,null,null,null,null,"","","","","",{"$f":"IF(C100=\"\",\"\",IF(ISNUMBER(SEARCH(\"Start&End\",B100)),SUM(P100:INDEX(P100:P204,MATCH(TRUE,(B100:B204=\"Start&End\"),0))),SUM(P100:INDEX(P100:P204,MATCH(TRUE,(B100:B204=\"End\"),0)))))","v":""},{"$f":"IF(C100=\"\",\"\",IF(ISNUMBER(SEARCH(\"Start&End\",B100)),SUM(Q100:INDEX(Q100:Q204,MATCH(TRUE,(B100:B204=\"Start&End\"),0))),SUM(Q100:INDEX(Q100:Q204,MATCH(TRUE,(B100:B204=\"End\"),0)))))","v":""},"",null,null,null,null,null,null,"","","","","","","","",null,"","","","","","","",null,"","","","","","","",null,"","","","","","","",null,"","","","","","",""]
[99,null,null,null,null,null,null,null,null,null,null,null,"","","","","",{"$f":"IF(C101=\"\",\"\",IF(ISNUMBER(SEARCH(\"Start&End\",B101)),SUM(P101:INDEX(P101:P205,MATCH(TRUE,(B101:B205=\"Start&End\"),0))),SUM(P101:INDEX(P101:P205,MATCH(TRUE,(B101:B205=\"End\"),0)))))","v":""},{"$f":"IF(C101=\"\",\"\",IF(ISNUMBER(SEARCH(\"Start&End\",B101)),SUM(Q101:INDEX(Q101:Q205,MATCH(TRUE,(B101:B205=\"Start&End\"),0))),SUM(Q101:INDEX(Q101:Q205,MATCH(TRUE,(B101:B205=\"End\"),0)))))","v":""},"",null,null,null,null,null,null,"","","","","","","","",null,"","","","","","","",null,"","","","","","","",null,"","","","","","","",null,"","","","","","",""]
[100,null,null,null,null,null,null,null,null,null,null,null,"","","","","",{"$f":"IF(C102=\"\",\"\",IF(ISNUMBER(SEARCH(\"Start&End\",B102)),SUM(P102:INDEX(P102:P206,MATCH(TRUE,(B102:B206=\"Start&End\"),0))),SUM(P102:INDEX(P102:P206,MATCH(TRUE,(B102:B206=\"End\"),0)))))","v":""},{"$f":"IF(C102=\"\",\"\",IF(ISNUMBER(SEARCH(\"Start&End\",B102)),SUM(Q102:INDEX(Q102:Q206,MATCH(TRUE,(B102:B206=\"Start&End\"),0))),SUM(Q102:INDEX(Q102:Q206,MATCH(TRUE,(B102:B206=\"End\"),0)))))","v":""},"",null,null,null,null,null,null,"","","","","","","","",null,"","","","","","","",null,"","","","","","","",null,"","","","","","","",null,"","","","","","",""]
[101,null,null,null,null,null,null,null,null,null,null,null,"","","","","",{"$f":"IF(C103=\"\",\"\",IF(ISNUMBER(SEARCH(\"Start&End\",B103)),SUM(P103:INDEX(P103:P207,MATCH(TRUE,(B103:B207=\"Start&End\"),0))),SUM(P103:INDEX(P103:P207,MATCH(TRUE,(B103:B207=\"End\"),0)))))","v":""},{"$f":"IF(C103=\"\",\"\",IF(ISNUMBER(SEARCH(\"Start&End\",B103)),SUM(Q103:INDEX(Q103:Q207,MATCH(TRUE,(B103:B207=\"Start&End\"),0))),SUM(Q103:INDEX(Q103:Q207,MATCH(TRUE,(B103:B207=\"End\"),0)))))","v":""},"",null,null,null,null,null,null,"","","","","","","","",null,"","","","","","","",null,"","","","","","","",null,"","","","","","","",null,"","","","","","",""]
[102,null,null,null,null,null,null,null,null,null,null,null,"","","","","",{"$f":"IF(C104=\"\",\"\",IF(ISNUMBER(SEARCH(\"Start&End\",B104)),SUM(P104:INDEX(P104:P208,MATCH(TRUE,(B104:B208=\"Start&End\"),0))),SUM(P104:INDEX(P104:P208,MATCH(TRUE,(B104:B208=\"End\"),0)))))","v":""},{"$f":"IF(C104=\"\",\"\",IF(ISNUMBER(SEARCH(\"Start&End\",B104)),SUM(Q104:INDEX(Q104:Q208,MATCH(TRUE,(B104:B208=\"Start&End\"),0))),SUM(Q104:INDEX(Q104:Q208,MATCH(TRUE,(B104:B208=\"End\"),0)))))","v":""},"",null,null,null,null,null,null,"","","","","","","","",null,"","","","","","","",null,"","","","","","","",null,"","","","","","","",null,"","","","","","",""]
[103,null,null,null,null,null,null,null,null,null,null,null,"","","","","",{"$f":"IF(C105=\"\",\"\",IF(ISNUMBER(SEARCH(\"Start&End\",B105)),SUM(P105:INDEX(P105:P209,MATCH(TRUE,(B105:B209=\"Start&End\"),0))),SUM(P105:INDEX(P105:P209,MATCH(TRUE,(B105:B209=\"End\"),0)))))","v":""},{"$f":"IF(C105=\"\",\"\",IF(ISNUMBER(SEARCH(\"Start&End\",B105)),SUM(Q105:INDEX(Q105:Q209,MATCH(TRUE,(B105:B209=\"Start&End\"),0))),SUM(Q105:INDEX(Q105:Q209,MATCH(TRUE,(B105:B209=\"End\"),0)))))","v":""},"",null,null,null,null,null,null,"","","","","","","","",null,"","","","","","","",null,"","","","","","","",null,"","","","","","","",null,"","","","","","",""]
[104,null,null,null,null,null,null,null,null,null,null,null,"","","","","",{"$f":"IF(C106=\"\",\"\",IF(ISNUMBER(SEARCH(\"Start&End\",B106)),SUM(P106:INDEX(P106:P210,MATCH(TRUE,(B106:B210=\"Start&End\"),0))),SUM(P106:INDEX(P106:P210,MATCH(TRUE,(B106:B210=\"End\"),0)))))","v":""},{"$f":"IF(C106=\"\",\"\",IF(ISNUMBER(SEARCH(\"Start&End\",B106)),SUM(Q106:INDEX(Q106:Q210,MATCH(TRUE,(B106:B210=\"Start&End\"),0))),SUM(Q106:INDEX(Q106:Q210,MATCH(TRUE,(B106:B210=\"End\"),0)))))","v":""},"",null,null,null,null,null,null,"","","","","","","","",null,"","","","","","","",null,"","","","","","","",null,"","","","","","","",null,"","","","","","",""]
[105,null,null,null,null,null,null,null,null,null,null,null,"","","","","",{"$f":"IF(C107=\"\",\"\",IF(ISNUMBER(SEARCH(\"Start&End\",B107)),SUM(P107:INDEX(P107:P211,MATCH(TRUE,(B107:B211=\"Start&End\"),0))),SUM(P107:INDEX(P107:P211,MATCH(TRUE,(B107:B211=\"End\"),0)))))","v":""},{"$f":"IF(C107=\"\",\"\",IF(ISNUMBER(SEARCH(\"Start&End\",B107)),SUM(Q107:INDEX(Q107:Q211,MATCH(TRUE,(B107:B211=\"Start&End\"),0))),SUM(Q107:INDEX(Q107:Q211,MATCH(TRUE,(B107:B211=\"End\"),0)))))","v":""},"",null,null,null,null,null,null,"","","","","","","","",null,"","","","","","","",null,"","","","","","","",null,"","","","","","","",null,"","","","","","",""]
[106,null,null,null,null,null,null,null,null,null,null,null,"","","","","",{"$f":"IF(C108=\"\",\"\",IF(ISNUMBER(SEARCH(\"Start&End\",B108)),SUM(P108:INDEX(P108:P212,MATCH(TRUE,(B108:B212=\"Start&End\"),0))),SUM(P108:INDEX(P108:P212,MATCH(TRUE,(B108:B212=\"End\"),0)))))","v":""},{"$f":"IF(C108=\"\",\"\",IF(ISNUMBER(SEARCH(\"Start&End\",B108)),SUM(Q108:INDEX(Q108:Q212,MATCH(TRUE,(B108:B212=\"Start&End\"),0))),SUM(Q108:INDEX(Q108:Q212,MATCH(TRUE,(B108:B212=\"End\"),0)))))","v":""},"",null,null,null,null,null,null,"","","","","","","","",null,"","","","","","","",null,"","","","","","","",null,"","","","","","","",null,"","","","","","",""]
[107,null,null,null,null,null,null,null,null,null,null,null,"","","","","",{"$f":"IF(C109=\"\",\"\",IF(ISNUMBER(SEARCH(\"Start&End\",B109)),SUM(P109:INDEX(P109:P213,MATCH(TRUE,(B109:B213=\"Start&End\"),0))),SUM(P109:INDEX(P109:P213,MATCH(TRUE,(B109:B213=\"End\"),0)))))","v":""},{"$f":"IF(C109=\"\",\"\",IF(ISNUMBER(SEARCH(\"Start&End\",B109)),SUM(Q109:INDEX(Q109:Q213,MATCH(TRUE,(B109:B213=\"Start&End\"),0))),SUM(Q109:INDEX(Q109:Q213,MATCH(TRUE,(B109:B213=\"End\"),0)))))","v":""},"",null,null,null,null,null,null,"","","","","","","","",null,"","","","","","","",null,"","","","","","","",null,"","","","","","","",null,"","","","","","",""]
[108,null,null,null,null,null,null,null,null,null,null,null,"","","","","",{"$f":"IF(C110=\"\",\"\",IF(ISNUMBER(SEARCH(\"Start&End\",B110)),SUM(P110:INDEX(P110:P214,MATCH(TRUE,(B110:B214=\"Start&End\"),0))),SUM(P110:INDEX(P110:P214,MATCH(TRUE,(B110:B214=\"End\"),0)))))","v":""},{"$f":"IF(C110=\"\",\"\",IF(ISNUMBER(SEARCH(\"Start&End\",B110)),SUM(Q110:INDEX(Q110:Q214,MATCH(TRUE,(B110:B214=\"Start&End\"),0))),SUM(Q110:INDEX(Q110:Q214,MATCH(TRUE,(B110:B214=\"End\"),0)))))","v":""},"",null,null,null,null,null,null,"","","","","","","","",null,"","","","","","","",null,"","","","","","","",null,"","","","","","","",null,"","","","","","",""]
[109,null,null,null,null,null,null,null,null,null,null,null,"","","","","",{"$f":"IF(C111=\"\",\"\",IF(ISNUMBER(SEARCH(\"Start&End\",B111)),SUM(P111:INDEX(P111:P215,MATCH(TRUE,(B111:B215=\"Start&End\"),0))),SUM(P111:INDEX(P111:P215,MATCH(TRUE,(B111:B215=\"End\"),0)))))","v":""},{"$f":"IF(C111=\"\",\"\",IF(ISNUMBER(SEARCH(\"Start&End\",B111)),SUM(Q111:INDEX(Q111:Q215,MATCH(TRUE,(B111:B215=\"Start&End\"),0))),SUM(Q111:INDEX(Q111:Q215,MATCH(TRUE,(B111:B215=\"End\"),0)))))","v":""},"",null,null,null,null,null,null,"","","","","","","","",null,"","","","","","","",null,"","","","","","","",null,"","","","","","","",null,"","","","","","",""]
[110,null,null,null,null,null,null,null,null,null,null,null,"","","","","",{"$f":"IF(C112=\"\",\"\",IF(ISNUMBER(SEARCH(\"Start&End\",B112)),SUM(P112:INDEX(P112:P216,MATCH(TRUE,(B112:B216=\"Start&End\"),0))),SUM(P112:INDEX(P112:P216,MATCH(TRUE,(B112:B216=\"End\"),0)))))","v":""},{"$f":"IF(C112=\"\",\"\",IF(ISNUMBER(SEARCH(\"Start&End\",B112)),SUM(Q112:INDEX(Q112:Q216,MATCH(TRUE,(B112:B216=\"Start&End\"),0))),SUM(Q112:INDEX(Q112:Q216,MATCH(TRUE,(B112:B216=\"End\"),0)))))","v":""},"",null,null,null,null,null,null,"","","","","","","","",null,"","","","","","","",null,"","","","","","","",null,"","","","","","","",null,"","","","","","",""]
[111,null,null,null,null,null,null,null,null,null,null,null,"","","","","",{"$f":"IF(C113=\"\",\"\",IF(ISNUMBER(SEARCH(\"Start&End\",B113)),SUM(P113:INDEX(P113:P217,MATCH(TRUE,(B113:B217=\"Start&End\"),0))),SUM(P113:INDEX(P113:P217,MATCH(TRUE,(B113:B217=\"End\"),0)))))","v":""},{"$f":"IF(C113=\"\",\"\",IF(ISNUMBER(SEARCH(\"Start&End\",B113)),SUM(Q113:INDEX(Q113:Q217,MATCH(TRUE,(B113:B217=\"Start&End\"),0))),SUM(Q113:INDEX(Q113:Q217,MATCH(TRUE,(B113:B217=\"End\"),0)))))","v":""},"",null,null,null,null,null,null,"","","","","","","","",null,"","","","","","","",null,"","","","","","","",null,"","","","","","","",null,"","","","","","",""]
[112,null,null,null,null,null,null,null,null,null,null,null,"","","","","",{"$f":"IF(C114=\"\",\"\",IF(ISNUMBER(SEARCH(\"Start&End\",B114)),SUM(P114:INDEX(P114:P218,MATCH(TRUE,(B114:B218=\"Start&End\"),0))),SUM(P114:INDEX(P114:P218,MATCH(TRUE,(B114:B218=\"End\"),0)))))","v":""},{"$f":"IF(C114=\"\",\"\",IF(ISNUMBER(SEARCH(\"Start&End\",B114)),SUM(Q114:INDEX(Q114:Q218,MATCH(TRUE,(B114:B218=\"Start&End\"),0))),SUM(Q114:INDEX(Q114:Q218,MATCH(TRUE,(B114:B218=\"End\"),0)))))","v":""},"",null,null,null,null,null,null,"","","","","","","","",null,"","","","","","","",null,"","","","","","","",null,"","","","","","","",null,"","","","","","",""]
[113,null,null,null,null,null,null,null,null,null,null,null,"","","","","",{"$f":"IF(C115=\"\",\"\",IF(ISNUMBER(SEARCH(\"Start&End\",B115)),SUM(P115:INDEX(P115:P219,MATCH(TRUE,(B115:B219=\"Start&End\"),0))),SUM(P115:INDEX(P115:P219,MATCH(TRUE,(B115:B219=\"End\"),0)))))","v":""},{"$f":"IF(C115=\"\",\"\",IF(ISNUMBER(SEARCH(\"Start&End\",B115)),SUM(Q115:INDEX(Q115:Q219,MATCH(TRUE,(B115:B219=\"Start&End\"),0))),SUM(Q115:INDEX(Q115:Q219,MATCH(TRUE,(B115:B219=\"End\"),0)))))","v":""},"",null,null,null,null,null,null,"","","","","","","","",null,"","","","","","","",null,"","","","","","","",null,"","","","","","","",null,"","","","","","",""]
[114,null,null,null,null,null,null,null,null,null,null,null,"","","","","",{"$f":"IF(C116=\"\",\"\",IF(ISNUMBER(SEARCH(\"Start&End\",B116)),SUM(P116:INDEX(P116:P220,MATCH(TRUE,(B116:B220=\"Start&End\"),0))),SUM(P116:INDEX(P116:P220,MATCH(TRUE,(B116:B220=\"End\"),0)))))","v":""},{"$f":"IF(C116=\"\",\"\",IF(ISNUMBER(SEARCH(\"Start&End\",B116)),SUM(Q116:INDEX(Q116:Q220,MATCH(TRUE,(B116:B220=\"Start&End\"),0))),SUM(Q116:INDEX(Q116:Q220,MATCH(TRUE,(B116:B220=\"End\"),0)))))","v":""},"",null,null,null,null,null,null,"","","","","","","","",null,"","","","","","","",null,"","","","","","","",null,"","","","","","","",null,"","","","","","",""]
[115,null,null,null,null,null,null,null,null,null,null,null,"","","","","",{"$f":"IF(C117=\"\",\"\",IF(ISNUMBER(SEARCH(\"Start&End\",B117)),SUM(P117:INDEX(P117:P221,MATCH(TRUE,(B117:B221=\"Start&End\"),0))),SUM(P117:INDEX(P117:P221,MATCH(TRUE,(B117:B221=\"End\"),0)))))","v":""},{"$f":"IF(C117=\"\",\"\",IF(ISNUMBER(SEARCH(\"Start&End\",B117)),SUM(Q117:INDEX(Q117:Q221,MATCH(TRUE,(B117:B221=\"Start&End\"),0))),SUM(Q117:INDEX(Q117:Q221,MATCH(TRUE,(B117:B221=\"End\"),0)))))","v":""},"",null,null,null,null,null,null,"","","","","","","","",null,"","","","","","","",null,"","","","","","","",null,"","","","","","","",null,"","","","","","",""]
[116,null,null,null,null,null,null,null,null,null,null,null,"","","","","",{"$f":"IF(C118=\"\",\"\",IF(ISNUMBER(SEARCH(\"Start&End\",B118)),SUM(P118:INDEX(P118:P222,MATCH(TRUE,(B118:B222=\"Start&End\"),0))),SUM(P118:INDEX(P118:P222,MATCH(TRUE,(B118:B222=\"End\"),0)))))","v":""},{"$f":"IF(C118=\"\",\"\",IF(ISNUMBER(SEARCH(\"Start&End\",B118)),SUM(Q118:INDEX(Q118:Q222,MATCH(TRUE,(B118:B222=\"Start&End\"),0))),SUM(Q118:INDEX(Q118:Q222,MATCH(TRUE,(B118:B222=\"End\"),0)))))","v":""},"",null,null,null,null,null,null,"","","","","","","","",null,"","","","","","","",null,"","","","","","","",null,"","","","","","","",null,"","","","","","",""]
[117,null,null,null,null,null,null,null,null,null,null,null,"","","","","",{"$f":"IF(C119=\"\",\"\",IF(ISNUMBER(SEARCH(\"Start&End\",B119)),SUM(P119:INDEX(P119:P223,MATCH(TRUE,(B119:B223=\"Start&End\"),0))),SUM(P119:INDEX(P119:P223,MATCH(TRUE,(B119:B223=\"End\"),0)))))","v":""},{"$f":"IF(C119=\"\",\"\",IF(ISNUMBER(SEARCH(\"Start&End\",B119)),SUM(Q119:INDEX(Q119:Q223,MATCH(TRUE,(B119:B223=\"Start&End\"),0))),SUM(Q119:INDEX(Q119:Q223,MATCH(TRUE,(B119:B223=\"End\"),0)))))","v":""},"",null,null,null,null,null,null,"","","","","","","","",null,"","","","","","","",null,"","","","","","","",null,"","","","","","","",null,"","","","","","",""]
[118,null,null,null,null,null,null,null,null,null,null,null,"","","","","",{"$f":"IF(C120=\"\",\"\",IF(ISNUMBER(SEARCH(\"Start&End\",B120)),SUM(P120:INDEX(P120:P224,MATCH(TRUE,(B120:B224=\"Start&End\"),0))),SUM(P120:INDEX(P120:P224,MATCH(TRUE,(B120:B224=\"End\"),0)))))","v":""},{"$f":"IF(C120=\"\",\"\",IF(ISNUMBER(SEARCH(\"Start&End\",B120)),SUM(Q120:INDEX(Q120:Q224,MATCH(TRUE,(B120:B224=\"Start&End\"),0))),SUM(Q120:INDEX(Q120:Q224,MATCH(TRUE,(B120:B224=\"End\"),0)))))","v":""},"",null,null,null,null,null,null,"","","","","","","","",null,"","","","","","","",null,"","","","","","","",null,"","","","","","","",null,"","","","","","",""]
[119,null,null,null,null,null,null,null,null,null,null,null,"","","","","",{"$f":"IF(C121=\"\",\"\",IF(ISNUMBER(SEARCH(\"Start&End\",B121)),SUM(P121:INDEX(P121:P225,MATCH(TRUE,(B121:B225=\"Start&End\"),0))),SUM(P121:INDEX(P121:P225,MATCH(TRUE,(B121:B225=\"End\"),0)))))","v":""},{"$f":"IF(C121=\"\",\"\",IF(ISNUMBER(SEARCH(\"Start&End\",B121)),SUM(Q121:INDEX(Q121:Q225,MATCH(TRUE,(B121:B225=\"Start&End\"),0))),SUM(Q121:INDEX(Q121:Q225,MATCH(TRUE,(B121:B225=\"End\"),0)))))","v":""},"",null,null,null,null,null,null,"","","","","","","","",null,"","","","","","","",null,"","","","","","","",null,"","","","","","","",null,"","","","","","",""]
[120,null,null,null,null,null,null,null,null,null,null,null,"","","","","",{"$f":"IF(C122=\"\",\"\",IF(ISNUMBER(SEARCH(\"Start&End\",B122)),SUM(P122:INDEX(P122:P226,MATCH(TRUE,(B122:B226=\"Start&End\"),0))),SUM(P122:INDEX(P122:P226,MATCH(TRUE,(B122:B226=\"End\"),0)))))","v":""},{"$f":"IF(C122=\"\",\"\",IF(ISNUMBER(SEARCH(\"Start&End\",B122)),SUM(Q122:INDEX(Q122:Q226,MATCH(TRUE,(B122:B226=\"Start&End\"),0))),SUM(Q122:INDEX(Q122:Q226,MATCH(TRUE,(B122:B226=\"End\"),0)))))","v":""},"",null,null,null,null,null,null,"","","","","","","","",null,"","","","","","","",null,"","","","","","","",null,"","","","","","","",null,"","","","","","",""]
[121,null,null,null,null,null,null,null,null,null,null,null,"","","","","",{"$f":"IF(C123=\"\",\"\",IF(ISNUMBER(SEARCH(\"Start&End\",B123)),SUM(P123:INDEX(P123:P227,MATCH(TRUE,(B123:B227=\"Start&End\"),0))),SUM(P123:INDEX(P123:P227,MATCH(TRUE,(B123:B227=\"End\"),0)))))","v":""},{"$f":"IF(C123=\"\",\"\",IF(ISNUMBER(SEARCH(\"Start&End\",B123)),SUM(Q123:INDEX(Q123:Q227,MATCH(TRUE,(B123:B227=\"Start&End\"),0))),SUM(Q123:INDEX(Q123:Q227,MATCH(TRUE,(B123:B227=\"End\"),0)))))","v":""},"",null,null,null,null,null,null,"","","","","","","","",null,"","","","","","","",null,"","","","","","","",null,"","","","","","","",null,"","","","","","",""]
[122,null,null,null,null,null,null,null,null,null,null,null,"","","","","",{"$f":"IF(C124=\"\",\"\",IF(ISNUMBER(SEARCH(\"Start&End\",B124)),SUM(P124:INDEX(P124:P228,MATCH(TRUE,(B124:B228=\"Start&End\"),0))),SUM(P124:INDEX(P124:P228,MATCH(TRUE,(B124:B228=\"End\"),0)))))","v":""},{"$f":"IF(C124=\"\",\"\",IF(ISNUMBER(SEARCH(\"Start&End\",B124)),SUM(Q124:INDEX(Q124:Q228,MATCH(TRUE,(B124:B228=\"Start&End\"),0))),SUM(Q124:INDEX(Q124:Q228,MATCH(TRUE,(B124:B228=\"End\"),0)))))","v":""},"",null,null,null,null,null,null,"","","","","","","","",null,"","","","","","","",null,"","","","","","","",null,"","","","","","","",null,"","","","","","",""]
[123,null,null,null,null,null,null,null,null,null,null,null,"","","","","",{"$f":"IF(C125=\"\",\"\",IF(ISNUMBER(SEARCH(\"Start&End\",B125)),SUM(P125:INDEX(P125:P229,MATCH(TRUE,(B125:B229=\"Start&End\"),0))),SUM(P125:INDEX(P125:P229,MATCH(TRUE,(B125:B229=\"End\"),0)))))","v":""},{"$f":"IF(C125=\"\",\"\",IF(ISNUMBER(SEARCH(\"Start&End\",B125)),SUM(Q125:INDEX(Q125:Q229,MATCH(TRUE,(B125:B229=\"Start&End\"),0))),SUM(Q125:INDEX(Q125:Q229,MATCH(TRUE,(B125:B229=\"End\"),0)))))","v":""},"",null,null,null,null,null,null,"","","","","","","","",null,"","","","","","","",null,"","","","","","","",null,"","","","","","","",null,"","","","","","",""]
[124,null,null,null,null,null,null,null,null,null,null,null,"","","","","",{"$f":"IF(C126=\"\",\"\",IF(ISNUMBER(SEARCH(\"Start&End\",B126)),SUM(P126:INDEX(P126:P230,MATCH(TRUE,(B126:B230=\"Start&End\"),0))),SUM(P126:INDEX(P126:P230,MATCH(TRUE,(B126:B230=\"End\"),0)))))","v":""},{"$f":"IF(C126=\"\",\"\",IF(ISNUMBER(SEARCH(\"Start&End\",B126)),SUM(Q126:INDEX(Q126:Q230,MATCH(TRUE,(B126:B230=\"Start&End\"),0))),SUM(Q126:INDEX(Q126:Q230,MATCH(TRUE,(B126:B230=\"End\"),0)))))","v":""},"",null,null,null,null,null,null,"","","","","","","","",null,"","","","","","","",null,"","","","","","","",null,"","","","","","","",null,"","","","","","",""]
[125,null,null,null,null,null,null,null,null,null,null,null,"","","","","",{"$f":"IF(C127=\"\",\"\",IF(ISNUMBER(SEARCH(\"Start&End\",B127)),SUM(P127:INDEX(P127:P231,MATCH(TRUE,(B127:B231=\"Start&End\"),0))),SUM(P127:INDEX(P127:P231,MATCH(TRUE,(B127:B231=\"End\"),0)))))","v":""},{"$f":"IF(C127=\"\",\"\",IF(ISNUMBER(SEARCH(\"Start&End\",B127)),SUM(Q127:INDEX(Q127:Q231,MATCH(TRUE,(B127:B231=\"Start&End\"),0))),SUM(Q127:INDEX(Q127:Q231,MATCH(TRUE,(B127:B231=\"End\"),0)))))","v":""},"",null,null,null,null,null,null,"","","","","","","","",null,"","","","","","","",null,"","","","","","","",null,"","","","","","","",null,"","","","","","",""]
[126,null,null,null,null,null,null,null,null,null,null,null,"","","","","",{"$f":"IF(C128=\"\",\"\",IF(ISNUMBER(SEARCH(\"Start&End\",B128)),SUM(P128:INDEX(P128:P232,MATCH(TRUE,(B128:B232=\"Start&End\"),0))),SUM(P128:INDEX(P128:P232,MATCH(TRUE,(B128:B232=\"End\"),0)))))","v":""},{"$f":"IF(C128=\"\",\"\",IF(ISNUMBER(SEARCH(\"Start&End\",B128)),SUM(Q128:INDEX(Q128:Q232,MATCH(TRUE,(B128:B232=\"Start&End\"),0))),SUM(Q128:INDEX(Q128:Q232,MATCH(TRUE,(B128:B232=\"End\"),0)))))","v":""},"",null,null,null,null,null,null,"","","","","","","","",null,"","","","","","","",null,"","","","","","","",null,"","","","","","","",null,"","","","","","",""]
[127,null,null,null,null,null,null,null,null,null,null,null,"","","","","",{"$f":"IF(C129=\"\",\"\",IF(ISNUMBER(SEARCH(\"Start&End\",B129)),SUM(P129:INDEX(P129:P233,MATCH(TRUE,(B129:B233=\"Start&End\"),0))),SUM(P129:INDEX(P129:P233,MATCH(TRUE,(B129:B233=\"End\"),0)))))","v":""},{"$f":"IF(C129=\"\",\"\",IF(ISNUMBER(SEARCH(\"Start&End\",B129)),SUM(Q129:INDEX(Q129:Q233,MATCH(TRUE,(B129:B233=\"Start&End\"),0))),SUM(Q129:INDEX(Q129:Q233,MATCH(TRUE,(B129:B233=\"End\"),0)))))","v":""},"",null,null,null,null,null,null,"","","","","","","","",null,"","","","","","","",null,"","","","","","","",null,"","","","","","","",null,"","","","","","",""]
[128,null,null,null,null,null,null,null,null,null,null,null,"","","","","",{"$f":"IF(C130=\"\",\"\",IF(ISNUMBER(SEARCH(\"Start&End\",B130)),SUM(P130:INDEX(P130:P234,MATCH(TRUE,(B130:B234=\"Start&End\"),0))),SUM(P130:INDEX(P130:P234,MATCH(TRUE,(B130:B234=\"End\"),0)))))","v":""},{"$f":"IF(C130=\"\",\"\",IF(ISNUMBER(SEARCH(\"Start&End\",B130)),SUM(Q130:INDEX(Q130:Q234,MATCH(TRUE,(B130:B234=\"Start&End\"),0))),SUM(Q130:INDEX(Q130:Q234,MATCH(TRUE,(B130:B234=\"End\"),0)))))","v":""},"",null,null,null,null,null,null,"","","","","","","","",null,"","","","","","","",null,"","","","","","","",null,"","","","","","","",null,"","","","","","",""]
[129,null,null,null,null,null,null,null,null,null,null,null,"","","","",{"$f":"IF(AA131=\"\",\"\",O131-P131)","v":""},{"$f":"IF(C131=\"\",\"\",IF(ISNUMBER(SEARCH(\"Start&End\",B131)),SUM(P131:INDEX(P131:P235,MATCH(TRUE,(B131:B235=\"Start&End\"),0))),SUM(P131:INDEX(P131:P235,MATCH(TRUE,(B131:B235=\"End\"),0)))))","v":""},{"$f":"IF(C131=\"\",\"\",IF(ISNUMBER(SEARCH(\"Start&End\",B131)),SUM(Q131:INDEX(Q131:Q235,MATCH(TRUE,(B131:B235=\"Start&End\"),0))),SUM(Q131:INDEX(Q131:Q235,MATCH(TRUE,(B131:B235=\"End\"),0)))))","v":""},{"$f":"IF(ISNUMBER(S131),S131,\"\")","v":""},null,null,null,null,null,null,{"$f":"IF((H131+I131)*G131=0,\"\",(H131+I131)*G131)","v":""},{"$f":"IF(ISNUMBER(SEARCH(\"FUT\",E131)),AZ131,IF(ISNUMBER(SEARCH(\"OPT\",E131)),BH131,IF(ISNUMBER(SEARCH(\"HOLD\",E131)),AJ131,AR131)))","v":""},{"$f":"IF(ISNUMBER(SEARCH(\"HOLD\",E131)),AK131,IF(ISNUMBER(SEARCH(\"INTRA\",E131)),AS131,IF(ISNUMBER(SEARCH(\"FUT\",E131)),BA131,BI131)))","v":""},{"$f":"IF(ISNUMBER(SEARCH(\"HOLD\",E131)),AL131,IF(ISNUMBER(SEARCH(\"INTRA\",E131)),AT131,IF(ISNUMBER(SEARCH(\"FUT\",E131)),BB131,BJ131)))","v":""},{"$f":"IF(ISNUMBER(SEARCH(\"HOLD\",E131)),AM131,IF(ISNUMBER(SEARCH(\"INTRA\",E131)),AU131,IF(ISNUMBER(SEARCH(\"FUT\",E131)),BC131,BK131)))","v":""},{"$f":"IF(ISNUMBER(SEARCH(\"HOLD\",E131)),AN131,IF(ISNUMBER(SEARCH(\"INTRA\",E131)),AV131,IF(ISNUMBER(SEARCH(\"FUT\",E131)),BD131,BL131)))","v":""},{"$f":"IF(ISNUMBER(SEARCH(\"HOLD\",E131)),AO131,IF(ISNUMBER(SEARCH(\"INTRA\",E131)),AW131,IF(ISNUMBER(SEARCH(\"FUT\",E131)),BE131,BM131)))","v":""},"",null,"","","","","",{"$f":"IF(G131&H131=\"\",\"\",ROUND(G131*H131*0.00015,2))","v":""},"",null,{"$f":"IF(MIN(20,((G131*H131*0.0003)))+MIN(20,((G131*H131*0.0003)))=0,\"\",MIN(20,((G131*H131*0.0003)))+MIN(20,((G131*H131*0.0003))))","v":""},{"$f":"IF(I131&G131=\"\",\"\",ROUND(I131*G131*0.00025,0))","v":""},"","","",{"$f":"IF(G131&H131=\"\",\"\",ROUND(G131*H131*0.00003,2))","v":""},"",null,{"$f":"IF(MIN(20,((G131*H131*0.0003)))+MIN(20,((G131*H131*0.0003)))=0,\"\",MIN(20,((G131*H131*0.0003)))+MIN(20,((G131*H131*0.0003))))","v":""},{"$f":"IF(I131&G131=\"\",\"\",ROUND(I131*G131*0.0001,0))","v":""},"","","",{"$f":"IF(G131&H131=\"\",\"\",ROUND(G131*H131*0.00002,2))","v":""},"",null,{"$f":"IF(AA131=\"\",\"\",40)","v":""},{"$f":"IF(I131&G131=\"\",\"\",ROUND(I131*G131*0.0005,0))","v":""},{"$f":"IF(AA131=\"\",\"\",ROUND(AA131*0.00053,2))","v":""},"",{"$f":"IF(AA131=\"\",\"\",ROUND((5/10000000)*AA131,2))","v":""},{"$f":"IF(G131&H131=\"\",\"\",ROUND(G131*H131*0.00003,2))","v":""},""]
[130,null,null,null,null,null,null,null,null,null,null,null,{"$f":"IF(OR(J132=\"\",K132=\"\"),\"\",IF(F132=\"Long\",  ((K132-H132)/(H132-J132)), ((I132-K132)/(J132-I132)) ))","v":""},{"$f":"IF(OR(I132=\"\",D132=\"\",H132=\"\",G132=\"\",E132=\"\",K132=\"\"),\"\",IF(I132=K132,\"Target Achieved\",IF(I132=J132,\"SL Hit\",IF(I132<J132,\"Extended SL Hit\",IF(I132>K132,\"Target Overachieved\",IF(AND(I132>=H132,I132<K132),\"Early Profit Exit\",\"Early Loss Exit\"))))))","v":""},{"$f":"IF(AA132=\"\",\"\",IF(OR(I132=\"\",H132=\"\"),0,G132*(I132-H132)))","v":""},{"$f":"IF(AH132=\"\",\"\",AH132)","v":""},"",{"$f":"IF(C132=\"\",\"\",IF(ISNUMBER(SEARCH(\"Start&End\",B132)),SUM(P132:INDEX(P132:P236,MATCH(TRUE,(B132:B236=\"Start&End\"),0))),SUM(P132:INDEX(P132:P236,MATCH(TRUE,(B132:B236=\"End\"),0)))))","v":""},{"$f":"IF(C132=\"\",\"\",IF(ISNUMBER(SEARCH(\"Start&End\",B132)),SUM(Q132:INDEX(Q132:Q236,MATCH(TRUE,(B132:B236=\"Start&End\"),0))),SUM(Q132:INDEX(Q132:Q236,MATCH(TRUE,(B132:B236=\"End\"),0)))))","v":""},"",null,null,null,null,null,null,"","","","","","","",{"$f":"IF(AB132&AC132&AD132&AE132&AF132&AG132=\"\",\"\",SUM(AB132:AG132))","v":""},null,{"$f":"IF(AA132=\"\",\"\",0)","v":""},{"$f":"IF(AA132=\"\",\"\",ROUND(AA132*0.001,2))","v":""},{"$f":"IF(AA132=\"\",\"\",ROUND(AA132*0.0000345,2))","v":""},{"$f":"IF(AJ132&AL132=\"\",\"\",ROUND((AJ132+AL132)*0.18,2))","v":""},{"$f":"IF(AA132=\"\",\"\",ROUND((5/10000000)*AA132,2))","v":""},"",{"$f":"IF(AK132&AL132&AM132&AN132&AO132=\"\",\"\",SUM(AK132:AO132))","v":""},null,"","",{"$f":"IF(AA132=\"\",\"\",ROUND(AA132*0.0000345,2))","v":""},{"$f":"IF(AR132&AT132=\"\",\"\",ROUND((AR132+AT132)*0.18,2))","v":""},{"$f":"IF(AA132=\"\",\"\",ROUND((5/10000000)*AA132,2))","v":""},"",{"$f":"IF(AR132&AS132&AT132&AU132&AV132&AW132=\"\",\"\",SUM(AR132:AW132))","v":""},null,"","",{"$f":"IF(AA132=\"\",\"\",ROUND(AA132*0.00002,2))","v":""},{"$f":"IF(AZ132&BB132=\"\",\"\",ROUND((AZ132+BB132)*0.18,2))","v":""},{"$f":"IF(AA132=\"\",\"\",ROUND((5/10000000)*AA132,2))","v":""},"","",null,"","","",{"$f":"IF(BH132&BJ132=\"\",\"\",ROUND((BH132+BJ132)*0.18,2))","v":""},"","",{"$f":"IF(BH132&BI132&BJ132&BK132&BL132&BM132=\"\",\"\",SUM(BH132:BM132))","v":""}]
[131,null,null,null,null,null,null,null,null,null,null,null,"","","","","",{"$f":"IF(C133=\"\",\"\",IF(ISNUMBER(SEARCH(\"Start&End\",B133)),SUM(P133:INDEX(P133:P237,MATCH(TRUE,(B133:B237=\"Start&End\"),0))),SUM(P133:INDEX(P133:P237,MATCH(TRUE,(B133:B237=\"End\"),0)))))","v":""},{"$f":"IF(C133=\"\",\"\",IF(ISNUMBER(SEARCH(\"Start&End\",B133)),SUM(Q133:INDEX(Q133:Q237,MATCH(TRUE,(B133:B237=\"Start&End\"),0))),SUM(Q133:INDEX(Q133:Q237,MATCH(TRUE,(B133:B237=\"End\"),0)))))","v":""},"",null,null,null,null,null,null,"","","","","","","","",null,"","","","","","","",null,"","","","","","","",null,"","","","","","",{"$f":"IF(FAX133&BA133&BB133&BC133&BD133&BE133=\"\",\"\",SUM(AZ133:BE133))","v":""},null,"","","","","","",""]
[132,null,null,null,null,null,null,null,null,null,null,null,"","","","","",{"$f":"IF(C134=\"\",\"\",IF(ISNUMBER(SEARCH(\"Start&End\",B134)),SUM(P134:INDEX(P134:P238,MATCH(TRUE,(B134:B238=\"Start&End\"),0))),SUM(P134:INDEX(P134:P238,MATCH(TRUE,(B134:B238=\"End\"),0)))))","v":""},{"$f":"IF(C134=\"\",\"\",IF(ISNUMBER(SEARCH(\"Start&End\",B134)),SUM(Q134:INDEX(Q134:Q238,MATCH(TRUE,(B134:B238=\"Start&End\"),0))),SUM(Q134:INDEX(Q134:Q238,MATCH(TRUE,(B134:B238=\"End\"),0)))))","v":""},"",null,null,null,null,null,null,"","","","","","","","",null,"","","","","","","",null,"","","","","","","",null,"","","","","","","",null,"","","","","","",""]
[133,null,null,null,null,null,null,null,null,null,null,null,"","","","","",{"$f":"IF(C135=\"\",\"\",IF(ISNUMBER(SEARCH(\"Start&End\",B135)),SUM(P135:INDEX(P135:P239,MATCH(TRUE,(B135:B239=\"Start&End\"),0))),SUM(P135:INDEX(P135:P239,MATCH(TRUE,(B135:B239=\"End\"),0)))))","v":""},{"$f":"IF(C135=\"\",\"\",IF(ISNUMBER(SEARCH(\"Start&End\",B135)),SUM(Q135:INDEX(Q135:Q239,MATCH(TRUE,(B135:B239=\"Start&End\"),0))),SUM(Q135:INDEX(Q135:Q239,MATCH(TRUE,(B135:B239=\"End\"),0)))))","v":""},"",null,null,null,null,null,null,"","","","","","","","",null,"","","","","","","",null,"","","","","","","",null,"","","","","","","",null,"","","","","","",""]
[134,null,null,null,null,null,null,null,null,null,null,null,"","","","","",{"$f":"IF(C136=\"\",\"\",IF(ISNUMBER(SEARCH(\"Start&End\",B136)),SUM(P136:INDEX(P136:P240,MATCH(TRUE,(B136:B240=\"Start&End\"),0))),SUM(P136:INDEX(P136:P240,MATCH(TRUE,(B136:B240=\"End\"),0)))))","v":""},{"$f":"IF(C136=\"\",\"\",IF(ISNUMBER(SEARCH(\"Start&End\",B136)),SUM(Q136:INDEX(Q136:Q240,MATCH(TRUE,(B136:B240=\"Start&End\"),0))),SUM(Q136:INDEX(Q136:Q240,MATCH(TRUE,(B136:B240=\"End\"),0)))))","v":""},"",null,null,null,null,null,null,"","","","","","","","",null,"","","","","","","",null,"","","","","","","",null,"","","","","","","",null,"","","","","","",""]
[135,null,null,null,null,null,null,null,null,null,null,null,"","","","","",{"$f":"IF(C137=\"\",\"\",IF(ISNUMBER(SEARCH(\"Start&End\",B137)),SUM(P137:INDEX(P137:P241,MATCH(TRUE,(B137:B241=\"Start&End\"),0))),SUM(P137:INDEX(P137:P241,MATCH(TRUE,(B137:B241=\"End\"),0)))))","v":""},{"$f":"IF(C137=\"\",\"\",IF(ISNUMBER(SEARCH(\"Start&End\",B137)),SUM(Q137:INDEX(Q137:Q241,MATCH(TRUE,(B137:B241=\"Start&End\"),0))),SUM(Q137:INDEX(Q137:Q241,MATCH(TRUE,(B137:B241=\"End\"),0)))))","v":""},"",null,null,null,null,null,null,"","","","","","","","",null,"","","","","","","",null,"","","","","","","",null,"","","","","","","",null,"","","","","","",""]
[136,null,null,null,null,null,null,null,null,null,null,null,"","","","","",{"$f":"IF(C138=\"\",\"\",IF(ISNUMBER(SEARCH(\"Start&End\",B138)),SUM(P138:INDEX(P138:P242,MATCH(TRUE,(B138:B242=\"Start&End\"),0))),SUM(P138:INDEX(P138:P242,MATCH(TRUE,(B138:B242=\"End\"),0)))))","v":""},{"$f":"IF(C138=\"\",\"\",IF(ISNUMBER(SEARCH(\"Start&End\",B138)),SUM(Q138:INDEX(Q138:Q242,MATCH(TRUE,(B138:B242=\"Start&End\"),0))),SUM(Q138:INDEX(Q138:Q242,MATCH(TRUE,(B138:B242=\"End\"),0)))))","v":""},"",null,null,null,null,null,null,"","","","","","","","",null,"","","","","","","",null,"","","","","","","",null,"","","","","","","",null,"","","","","","",""]
[137,null,null,null,null,null,null,null,null,null,null,null,"","","","","",{"$f":"IF(C139=\"\",\"\",IF(ISNUMBER(SEARCH(\"Start&End\",B139)),SUM(P139:INDEX(P139:P243,MATCH(TRUE,(B139:B243=\"Start&End\"),0))),SUM(P139:INDEX(P139:P243,MATCH(TRUE,(B139:B243=\"End\"),0)))))","v":""},{"$f":"IF(C139=\"\",\"\",IF(ISNUMBER(SEARCH(\"Start&End\",B139)),SUM(Q139:INDEX(Q139:Q243,MATCH(TRUE,(B139:B243=\"Start&End\"),0))),SUM(Q139:INDEX(Q139:Q243,MATCH(TRUE,(B139:B243=\"End\"),0)))))","v":""},"",null,null,null,null,null,null,"","","","","","","","",null,"","","","","","","",null,"","","","","","","",null,"","","","","","","",null,"","","","","","",""]
[138,null,null,null,null,null,null,null,null,null,null,null,"","","","","",{"$f":"IF(C140=\"\",\"\",IF(ISNUMBER(SEARCH(\"Start&End\",B140)),SUM(P140:INDEX(P140:P244,MATCH(TRUE,(B140:B244=\"Start&End\"),0))),SUM(P140:INDEX(P140:P244,MATCH(TRUE,(B140:B244=\"End\"),0)))))","v":""},{"$f":"IF(C140=\"\",\"\",IF(ISNUMBER(SEARCH(\"Start&End\",B140)),SUM(Q140:INDEX(Q140:Q244,MATCH(TRUE,(B140:B244=\"Start&End\"),0))),SUM(Q140:INDEX(Q140:Q244,MATCH(TRUE,(B140:B244=\"End\"),0)))))","v":""},"",null,null,null,null,null,null,"","","","","","","","",null,"","","","","","","",null,"","","","","","","",null,"","","","","","","",null,"","","","","","",""]
[139,null,null,null,null,null,null,null,null,null,null,null,"","","","","",{"$f":"IF(C141=\"\",\"\",IF(ISNUMBER(SEARCH(\"Start&End\",B141)),SUM(P141:INDEX(P141:P245,MATCH(TRUE,(B141:B245=\"Start&End\"),0))),SUM(P141:INDEX(P141:P245,MATCH(TRUE,(B141:B245=\"End\"),0)))))","v":""},{"$f":"IF(C141=\"\",\"\",IF(ISNUMBER(SEARCH(\"Start&End\",B141)),SUM(Q141:INDEX(Q141:Q245,MATCH(TRUE,(B141:B245=\"Start&End\"),0))),SUM(Q141:INDEX(Q141:Q245,MATCH(TRUE,(B141:B245=\"End\"),0)))))","v":""},"",null,null,null,null,null,null,"","","","","","","","",null,"","","","","","","",null,"","","","","","","",null,"","","","","","","",null,"","","","","","",""]
[140,null,null,null,null,null,null,null,null,null,null,null,"","","","","",{"$f":"IF(C142=\"\",\"\",IF(ISNUMBER(SEARCH(\"Start&End\",B142)),SUM(P142:INDEX(P142:P246,MATCH(TRUE,(B142:B246=\"Start&End\"),0))),SUM(P142:INDEX(P142:P246,MATCH(TRUE,(B142:B246=\"End\"),0)))))","v":""},{"$f":"IF(C142=\"\",\"\",IF(ISNUMBER(SEARCH(\"Start&End\",B142)),SUM(Q142:INDEX(Q142:Q246,MATCH(TRUE,(B142:B246=\"Start&End\"),0))),SUM(Q142:INDEX(Q142:Q246,MATCH(TRUE,(B142:B246=\"End\"),0)))))","v":""},"",null,null,null,null,null,null,"","","","","","","","",null,"","","","","","","",null,"","","","","","","",null,"","","","","","","",null,"","","","","","",""]
[141,null,null,null,null,null,null,null,null,null,null,null,"","","","","",{"$f":"IF(C143=\"\",\"\",IF(ISNUMBER(SEARCH(\"Start&End\",B143)),SUM(P143:INDEX(P143:P247,MATCH(TRUE,(B143:B247=\"Start&End\"),0))),SUM(P143:INDEX(P143:P247,MATCH(TRUE,(B143:B247=\"End\"),0)))))","v":""},{"$f":"IF(C143=\"\",\"\",IF(ISNUMBER(SEARCH(\"Start&End\",B143)),SUM(Q143:INDEX(Q143:Q247,MATCH(TRUE,(B143:B247=\"Start&End\"),0))),SUM(Q143:INDEX(Q143:Q247,MATCH(TRUE,(B143:B247=\"End\"),0)))))","v":""},"",null,null,null,null,null,null,"","","","","","","","",null,"","","","","","","",null,"","","","","","","",null,"","","","","","","",null,"","","","","","",""]
[142,null,null,null,null,null,null,null,null,null,null,null,"","","","","",{"$f":"IF(C144=\"\",\"\",IF(ISNUMBER(SEARCH(\"Start&End\",B144)),SUM(P144:INDEX(P144:P248,MATCH(TRUE,(B144:B248=\"Start&End\"),0))),SUM(P144:INDEX(P144:P248,MATCH(TRUE,(B144:B248=\"End\"),0)))))","v":""},{"$f":"IF(C144=\"\",\"\",IF(ISNUMBER(SEARCH(\"Start&End\",B144)),SUM(Q144:INDEX(Q144:Q248,MATCH(TRUE,(B144:B248=\"Start&End\"),0))),SUM(Q144:INDEX(Q144:Q248,MATCH(TRUE,(B144:B248=\"End\"),0)))))","v":""},"",null,null,null,null,null,null,"","","","","","","","",null,"","","","","","","",null,"","","","","","","",null,"","","","","","","",null,"","","","","","",""]
[143,null,null,null,null,null,null,null,null,null,null,null,"","","","","",{"$f":"IF(C145=\"\",\"\",IF(ISNUMBER(SEARCH(\"Start&End\",B145)),SUM(P145:INDEX(P145:P249,MATCH(TRUE,(B145:B249=\"Start&End\"),0))),SUM(P145:INDEX(P145:P249,MATCH(TRUE,(B145:B249=\"End\"),0)))))","v":""},{"$f":"IF(C145=\"\",\"\",IF(ISNUMBER(SEARCH(\"Start&End\",B145)),SUM(Q145:INDEX(Q145:Q249,MATCH(TRUE,(B145:B249=\"Start&End\"),0))),SUM(Q145:INDEX(Q145:Q249,MATCH(TRUE,(B145:B249=\"End\"),0)))))","v":""},"",null,null,null,null,null,null,"","","","","","","","",null,"","","","","","","",null,"","","","","","","",null,"","","","","","","",null,"","","","","","",""]
[144,null,null,null,null,null,null,null,null,null,null,null,"","","","","",{"$f":"IF(C146=\"\",\"\",IF(ISNUMBER(SEARCH(\"Start&End\",B146)),SUM(P146:INDEX(P146:P250,MATCH(TRUE,(B146:B250=\"Start&End\"),0))),SUM(P146:INDEX(P146:P250,MATCH(TRUE,(B146:B250=\"End\"),0)))))","v":""},{"$f":"IF(C146=\"\",\"\",IF(ISNUMBER(SEARCH(\"Start&End\",B146)),SUM(Q146:INDEX(Q146:Q250,MATCH(TRUE,(B146:B250=\"Start&End\"),0))),SUM(Q146:INDEX(Q146:Q250,MATCH(TRUE,(B146:B250=\"End\"),0)))))","v":""},"",null,null,null,null,null,null,"","","","","","","","",null,"","","","","","","",null,"","","","","","","",null,"","","","","","","",null,"","","","","","",""]
[145,null,null,null,null,null,null,null,null,null,null,null,"","","","","",{"$f":"IF(C147=\"\",\"\",IF(ISNUMBER(SEARCH(\"Start&End\",B147)),SUM(P147:INDEX(P147:P251,MATCH(TRUE,(B147:B251=\"Start&End\"),0))),SUM(P147:INDEX(P147:P251,MATCH(TRUE,(B147:B251=\"End\"),0)))))","v":""},{"$f":"IF(C147=\"\",\"\",IF(ISNUMBER(SEARCH(\"Start&End\",B147)),SUM(Q147:INDEX(Q147:Q251,MATCH(TRUE,(B147:B251=\"Start&End\"),0))),SUM(Q147:INDEX(Q147:Q251,MATCH(TRUE,(B147:B251=\"End\"),0)))))","v":""},"",null,null,null,null,null,null,"","","","","","","","",null,"","","","","","","",null,"","","","","","","",null,"","","","","","","",null,"","","","","","",""]
[146,null,null,null,null,null,null,null,null,null,null,null,"","","","","",{"$f":"IF(C148=\"\",\"\",IF(ISNUMBER(SEARCH(\"Start&End\",B148)),SUM(P148:INDEX(P148:P252,MATCH(TRUE,(B148:B252=\"Start&End\"),0))),SUM(P148:INDEX(P148:P252,MATCH(TRUE,(B148:B252=\"End\"),0)))))","v":""},{"$f":"IF(C148=\"\",\"\",IF(ISNUMBER(SEARCH(\"Start&End\",B148)),SUM(Q148:INDEX(Q148:Q252,MATCH(TRUE,(B148:B252=\"Start&End\"),0))),SUM(Q148:INDEX(Q148:Q252,MATCH(TRUE,(B148:B252=\"End\"),0)))))","v":""},"",null,null,null,null,null,null,"","","","","","","","",null,"","","","","","","",null,"","","","","","","",null,"","","","","","","",null,"","","","","","",""]
[147,null,null,null,null,null,null,null,null,null,null,null,"","","","","",{"$f":"IF(C149=\"\",\"\",IF(ISNUMBER(SEARCH(\"Start&End\",B149)),SUM(P149:INDEX(P149:P253,MATCH(TRUE,(B149:B253=\"Start&End\"),0))),SUM(P149:INDEX(P149:P253,MATCH(TRUE,(B149:B253=\"End\"),0)))))","v":""},{"$f":"IF(C149=\"\",\"\",IF(ISNUMBER(SEARCH(\"Start&End\",B149)),SUM(Q149:INDEX(Q149:Q253,MATCH(TRUE,(B149:B253=\"Start&End\"),0))),SUM(Q149:INDEX(Q149:Q253,MATCH(TRUE,(B149:B253=\"End\"),0)))))","v":""},"",null,null,null,null,null,null,"","","","","","","","",null,"","","","","","","",null,"","","","","","","",null,"","","","","","","",null,"","","","","","",""]
[148,null,null,null,null,null,null,null,null,null,null,null,"","","","","",{"$f":"IF(C150=\"\",\"\",IF(ISNUMBER(SEARCH(\"Start&End\",B150)),SUM(P150:INDEX(P150:P254,MATCH(TRUE,(B150:B254=\"Start&End\"),0))),SUM(P150:INDEX(P150:P254,MATCH(TRUE,(B150:B254=\"End\"),0)))))","v":""},{"$f":"IF(C150=\"\",\"\",IF(ISNUMBER(SEARCH(\"Start&End\",B150)),SUM(Q150:INDEX(Q150:Q254,MATCH(TRUE,(B150:B254=\"Start&End\"),0))),SUM(Q150:INDEX(Q150:Q254,MATCH(TRUE,(B150:B254=\"End\"),0)))))","v":""},"",null,null,null,null,null,null,"","","","","","","","",null,"","","","","","","",null,"","","","","","","",null,"","","","","","","",null,"","","","","","",""]
[149,null,null,null,null,null,null,null,null,null,null,null,"","","","","",{"$f":"IF(C151=\"\",\"\",IF(ISNUMBER(SEARCH(\"Start&End\",B151)),SUM(P151:INDEX(P151:P255,MATCH(TRUE,(B151:B255=\"Start&End\"),0))),SUM(P151:INDEX(P151:P255,MATCH(TRUE,(B151:B255=\"End\"),0)))))","v":""},{"$f":"IF(C151=\"\",\"\",IF(ISNUMBER(SEARCH(\"Start&End\",B151)),SUM(Q151:INDEX(Q151:Q255,MATCH(TRUE,(B151:B255=\"Start&End\"),0))),SUM(Q151:INDEX(Q151:Q255,MATCH(TRUE,(B151:B255=\"End\"),0)))))","v":""},"",null,null,null,null,null,null,"","","","","","","","",null,"","","","","","","",null,"","","","","","","",null,"","","","","","","",null,"","","","","","",""]
[150,null,null,null,null,null,null,null,null,null,null,null,"","","","","",{"$f":"IF(C152=\"\",\"\",IF(ISNUMBER(SEARCH(\"Start&End\",B152)),SUM(P152:INDEX(P152:P256,MATCH(TRUE,(B152:B256=\"Start&End\"),0))),SUM(P152:INDEX(P152:P256,MATCH(TRUE,(B152:B256=\"End\"),0)))))","v":""},{"$f":"IF(C152=\"\",\"\",IF(ISNUMBER(SEARCH(\"Start&End\",B152)),SUM(Q152:INDEX(Q152:Q256,MATCH(TRUE,(B152:B256=\"Start&End\"),0))),SUM(Q152:INDEX(Q152:Q256,MATCH(TRUE,(B152:B256=\"End\"),0)))))","v":""},"",null,null,null,null,null,null,"","","","","","","","",null,"","","","","","","",null,"","","","","","","",null,"","","","","","","",null,"","","","","","",""]
[151,null,null,null,null,null,null,null,null,null,null,null,"","","","","",{"$f":"IF(C153=\"\",\"\",IF(ISNUMBER(SEARCH(\"Start&End\",B153)),SUM(P153:INDEX(P153:P257,MATCH(TRUE,(B153:B257=\"Start&End\"),0))),SUM(P153:INDEX(P153:P257,MATCH(TRUE,(B153:B257=\"End\"),0)))))","v":""},{"$f":"IF(C153=\"\",\"\",IF(ISNUMBER(SEARCH(\"Start&End\",B153)),SUM(Q153:INDEX(Q153:Q257,MATCH(TRUE,(B153:B257=\"Start&End\"),0))),SUM(Q153:INDEX(Q153:Q257,MATCH(TRUE,(B153:B257=\"End\"),0)))))","v":""},"",null,null,null,null,null,null,"","","","","","","","",null,"","","","","","","",null,"","","","","","","",null,"","","","","","","",null,"","","","","","",""]
[152,null,null,null,null,null,null,null,null,null,null,null,"","","","","",{"$f":"IF(C154=\"\",\"\",IF(ISNUMBER(SEARCH(\"Start&End\",B154)),SUM(P154:INDEX(P154:P258,MATCH(TRUE,(B154:B258=\"Start&End\"),0))),SUM(P154:INDEX(P154:P258,MATCH(TRUE,(B154:B258=\"End\"),0)))))","v":""},{"$f":"IF(C154=\"\",\"\",IF(ISNUMBER(SEARCH(\"Start&End\",B154)),SUM(Q154:INDEX(Q154:Q258,MATCH(TRUE,(B154:B258=\"Start&End\"),0))),SUM(Q154:INDEX(Q154:Q258,MATCH(TRUE,(B154:B258=\"End\"),0)))))","v":""},"",null,null,null,null,null,null,"","","","","","","","",null,"","","","","","","",null,"","","","","","","",null,"","","","","","","",null,"","","","","","",""]
[153,null,null,null,null,null,null,null,null,null,null,null,"","","","","",{"$f":"IF(C155=\"\",\"\",IF(ISNUMBER(SEARCH(\"Start&End\",B155)),SUM(P155:INDEX(P155:P259,MATCH(TRUE,(B155:B259=\"Start&End\"),0))),SUM(P155:INDEX(P155:P259,MATCH(TRUE,(B155:B259=\"End\"),0)))))","v":""},{"$f":"IF(C155=\"\",\"\",IF(ISNUMBER(SEARCH(\"Start&End\",B155)),SUM(Q155:INDEX(Q155:Q259,MATCH(TRUE,(B155:B259=\"Start&End\"),0))),SUM(Q155:INDEX(Q155:Q259,MATCH(TRUE,(B155:B259=\"End\"),0)))))","v":""},"",null,null,null,null,null,null,"","","","","","","","",null,"","","","","","","",null,"","","","","","","",null,"","","","","","","",null,"","","","","","",""]
[154,null,null,null,null,null,null,null,null,null,null,null,"","","","","",{"$f":"IF(C156=\"\",\"\",IF(ISNUMBER(SEARCH(\"Start&End\",B156)),SUM(P156:INDEX(P156:P260,MATCH(TRUE,(B156:B260=\"Start&End\"),0))),SUM(P156:INDEX(P156:P260,MATCH(TRUE,(B156:B260=\"End\"),0)))))","v":""},{"$f":"IF(C156=\"\",\"\",IF(ISNUMBER(SEARCH(\"Start&End\",B156)),SUM(Q156:INDEX(Q156:Q260,MATCH(TRUE,(B156:B260=\"Start&End\"),0))),SUM(Q156:INDEX(Q156:Q260,MATCH(TRUE,(B156:B260=\"End\"),0)))))","v":""},"",null,null,null,null,null,null,"","","","","","","","",null,"","","","","","","",null,"","","","","","","",null,"","","","","","","",null,"","","","","","",""]
[155,null,null,null,null,null,null,null,null,null,null,null,"","","","","",{"$f":"IF(C157=\"\",\"\",IF(ISNUMBER(SEARCH(\"Start&End\",B157)),SUM(P157:INDEX(P157:P261,MATCH(TRUE,(B157:B261=\"Start&End\"),0))),SUM(P157:INDEX(P157:P261,MATCH(TRUE,(B157:B261=\"End\"),0)))))","v":""},{"$f":"IF(C157=\"\",\"\",IF(ISNUMBER(SEARCH(\"Start&End\",B157)),SUM(Q157:INDEX(Q157:Q261,MATCH(TRUE,(B157:B261=\"Start&End\"),0))),SUM(Q157:INDEX(Q157:Q261,MATCH(TRUE,(B157:B261=\"End\"),0)))))","v":""},"",null,null,null,null,null,null,"","","","","","","","",null,"","","","","","","",null,"","","","","","","",null,"","","","","","","",null,"","","","","","",""]
[156,null,null,null,null,null,null,null,null,null,null,null,"","","","","",{"$f":"IF(C158=\"\",\"\",IF(ISNUMBER(SEARCH(\"Start&End\",B158)),SUM(P158:INDEX(P158:P262,MATCH(TRUE,(B158:B262=\"Start&End\"),0))),SUM(P158:INDEX(P158:P262,MATCH(TRUE,(B158:B262=\"End\"),0)))))","v":""},{"$f":"IF(C158=\"\",\"\",IF(ISNUMBER(SEARCH(\"Start&End\",B158)),SUM(Q158:INDEX(Q158:Q262,MATCH(TRUE,(B158:B262=\"Start&End\"),0))),SUM(Q158:INDEX(Q158:Q262,MATCH(TRUE,(B158:B262=\"End\"),0)))))","v":""},"",null,null,null,null,null,null,"","","","","","","","",null,"","","","","","","",null,"","","","","","","",null,"","","","","","","",null,"","","","","","",""]
[157,null,null,null,null,null,null,null,null,null,null,null,"","","","","",{"$f":"IF(C159=\"\",\"\",IF(ISNUMBER(SEARCH(\"Start&End\",B159)),SUM(P159:INDEX(P159:P263,MATCH(TRUE,(B159:B263=\"Start&End\"),0))),SUM(P159:INDEX(P159:P263,MATCH(TRUE,(B159:B263=\"End\"),0)))))","v":""},{"$f":"IF(C159=\"\",\"\",IF(ISNUMBER(SEARCH(\"Start&End\",B159)),SUM(Q159:INDEX(Q159:Q263,MATCH(TRUE,(B159:B263=\"Start&End\"),0))),SUM(Q159:INDEX(Q159:Q263,MATCH(TRUE,(B159:B263=\"End\"),0)))))","v":""},"",null,null,null,null,null,null,"","","","","","","","",null,"","","","","","","",null,"","","","","","","",null,"","","","","","","",null,"","","","","","",""]
[158,null,null,null,null,null,null,null,null,null,null,null,"","","","","",{"$f":"IF(C160=\"\",\"\",IF(ISNUMBER(SEARCH(\"Start&End\",B160)),SUM(P160:INDEX(P160:P264,MATCH(TRUE,(B160:B264=\"Start&End\"),0))),SUM(P160:INDEX(P160:P264,MATCH(TRUE,(B160:B264=\"End\"),0)))))","v":""},{"$f":"IF(C160=\"\",\"\",IF(ISNUMBER(SEARCH(\"Start&End\",B160)),SUM(Q160:INDEX(Q160:Q264,MATCH(TRUE,(B160:B264=\"Start&End\"),0))),SUM(Q160:INDEX(Q160:Q264,MATCH(TRUE,(B160:B264=\"End\"),0)))))","v":""},"",null,null,null,null,null,null,"","","","","","","","",null,"","","","","","","",null,"","","","","","","",null,"","","","","","","",null,"","","","","","",""]
[159,null,null,null,null,null,null,null,null,null,null,null,"","","","","",{"$f":"IF(C161=\"\",\"\",IF(ISNUMBER(SEARCH(\"Start&End\",B161)),SUM(P161:INDEX(P161:P265,MATCH(TRUE,(B161:B265=\"Start&End\"),0))),SUM(P161:INDEX(P161:P265,MATCH(TRUE,(B161:B265=\"End\"),0)))))","v":""},{"$f":"IF(C161=\"\",\"\",IF(ISNUMBER(SEARCH(\"Start&End\",B161)),SUM(Q161:INDEX(Q161:Q265,MATCH(TRUE,(B161:B265=\"Start&End\"),0))),SUM(Q161:INDEX(Q161:Q265,MATCH(TRUE,(B161:B265=\"End\"),0)))))","v":""},"",null,null,null,null,null,null,"","","","","","","","",null,"","","","","","","",null,"","","","","","","",null,"","","","","","","",null,"","","","","","",""]
[160,null,null,null,null,null,null,null,null,null,null,null,"","","","","",{"$f":"IF(C162=\"\",\"\",IF(ISNUMBER(SEARCH(\"Start&End\",B162)),SUM(P162:INDEX(P162:P266,MATCH(TRUE,(B162:B266=\"Start&End\"),0))),SUM(P162:INDEX(P162:P266,MATCH(TRUE,(B162:B266=\"End\"),0)))))","v":""},{"$f":"IF(C162=\"\",\"\",IF(ISNUMBER(SEARCH(\"Start&End\",B162)),SUM(Q162:INDEX(Q162:Q266,MATCH(TRUE,(B162:B266=\"Start&End\"),0))),SUM(Q162:INDEX(Q162:Q266,MATCH(TRUE,(B162:B266=\"End\"),0)))))","v":""},"",null,null,null,null,null,null,"","","","","","","","",null,"","","","","","","",null,"","","","","","","",null,"","","","","","","",null,"","","","","","",""]
[161,null,null,null,null,null,null,null,null,null,null,null,"","","","","",{"$f":"IF(C163=\"\",\"\",IF(ISNUMBER(SEARCH(\"Start&End\",B163)),SUM(P163:INDEX(P163:P267,MATCH(TRUE,(B163:B267=\"Start&End\"),0))),SUM(P163:INDEX(P163:P267,MATCH(TRUE,(B163:B267=\"End\"),0)))))","v":""},{"$f":"IF(C163=\"\",\"\",IF(ISNUMBER(SEARCH(\"Start&End\",B163)),SUM(Q163:INDEX(Q163:Q267,MATCH(TRUE,(B163:B267=\"Start&End\"),0))),SUM(Q163:INDEX(Q163:Q267,MATCH(TRUE,(B163:B267=\"End\"),0)))))","v":""},"",null,null,null,null,null,null,"","","","","","","","",null,"","","","","","","",null,"","","","","","","",null,"","","","","","","",null,"","","","","","",""]
[162,null,null,null,null,null,null,null,null,null,null,null,"","","","","",{"$f":"IF(C164=\"\",\"\",IF(ISNUMBER(SEARCH(\"Start&End\",B164)),SUM(P164:INDEX(P164:P268,MATCH(TRUE,(B164:B268=\"Start&End\"),0))),SUM(P164:INDEX(P164:P268,MATCH(TRUE,(B164:B268=\"End\"),0)))))","v":""},{"$f":"IF(C164=\"\",\"\",IF(ISNUMBER(SEARCH(\"Start&End\",B164)),SUM(Q164:INDEX(Q164:Q268,MATCH(TRUE,(B164:B268=\"Start&End\"),0))),SUM(Q164:INDEX(Q164:Q268,MATCH(TRUE,(B164:B268=\"End\"),0)))))","v":""},"",null,null,null,null,null,null,"","","","","","","","",null,"","","","","","","",null,"","","","","","","",null,"","","","","","","",null,"","","","","","",""]
[163,null,null,null,null,null,null,null,null,null,null,null,"","","","","",{"$f":"IF(C165=\"\",\"\",IF(ISNUMBER(SEARCH(\"Start&End\",B165)),SUM(P165:INDEX(P165:P269,MATCH(TRUE,(B165:B269=\"Start&End\"),0))),SUM(P165:INDEX(P165:P269,MATCH(TRUE,(B165:B269=\"End\"),0)))))","v":""},{"$f":"IF(C165=\"\",\"\",IF(ISNUMBER(SEARCH(\"Start&End\",B165)),SUM(Q165:INDEX(Q165:Q269,MATCH(TRUE,(B165:B269=\"Start&End\"),0))),SUM(Q165:INDEX(Q165:Q269,MATCH(TRUE,(B165:B269=\"End\"),0)))))","v":""},"",null,null,null,null,null,null,"","","","","","","","",null,"","","","","","","",null,"","","","","","","",null,"","","","","","","",null,"","","","","","",""]
[164,null,null,null,null,null,null,null,null,null,null,null,"","","","","",{"$f":"IF(C166=\"\",\"\",IF(ISNUMBER(SEARCH(\"Start&End\",B166)),SUM(P166:INDEX(P166:P270,MATCH(TRUE,(B166:B270=\"Start&End\"),0))),SUM(P166:INDEX(P166:P270,MATCH(TRUE,(B166:B270=\"End\"),0)))))","v":""},{"$f":"IF(C166=\"\",\"\",IF(ISNUMBER(SEARCH(\"Start&End\",B166)),SUM(Q166:INDEX(Q166:Q270,MATCH(TRUE,(B166:B270=\"Start&End\"),0))),SUM(Q166:INDEX(Q166:Q270,MATCH(TRUE,(B166:B270=\"End\"),0)))))","v":""},"",null,null,null,null,null,null,"","","","","","","","",null,"","","","","","","",null,"","","","","","","",null,"","","","","","","",null,"","","","","","",""]
[165,null,null,null,null,null,null,null,null,null,null,null,"","","","","",{"$f":"IF(C167=\"\",\"\",IF(ISNUMBER(SEARCH(\"Start&End\",B167)),SUM(P167:INDEX(P167:P271,MATCH(TRUE,(B167:B271=\"Start&End\"),0))),SUM(P167:INDEX(P167:P271,MATCH(TRUE,(B167:B271=\"End\"),0)))))","v":""},{"$f":"IF(C167=\"\",\"\",IF(ISNUMBER(SEARCH(\"Start&End\",B167)),SUM(Q167:INDEX(Q167:Q271,MATCH(TRUE,(B167:B271=\"Start&End\"),0))),SUM(Q167:INDEX(Q167:Q271,MATCH(TRUE,(B167:B271=\"End\"),0)))))","v":""},"",null,null,null,null,null,null,"","","","","","","","",null,"","","","","","","",null,"","","","","","","",null,"","","","","","","",null,"","","","","","",""]
[166,null,null,null,null,null,null,null,null,null,null,null,"","","","","",{"$f":"IF(C168=\"\",\"\",IF(ISNUMBER(SEARCH(\"Start&End\",B168)),SUM(P168:INDEX(P168:P272,MATCH(TRUE,(B168:B272=\"Start&End\"),0))),SUM(P168:INDEX(P168:P272,MATCH(TRUE,(B168:B272=\"End\"),0)))))","v":""},{"$f":"IF(C168=\"\",\"\",IF(ISNUMBER(SEARCH(\"Start&End\",B168)),SUM(Q168:INDEX(Q168:Q272,MATCH(TRUE,(B168:B272=\"Start&End\"),0))),SUM(Q168:INDEX(Q168:Q272,MATCH(TRUE,(B168:B272=\"End\"),0)))))","v":""},"",null,null,null,null,null,null,"","","","","","","","",null,"","","","","","","",null,"","","","","","","",null,"","","","","","","",null,"","","","","","",""]
[167,null,null,null,null,null,null,null,null,null,null,null,"","","","","",{"$f":"IF(C169=\"\",\"\",IF(ISNUMBER(SEARCH(\"Start&End\",B169)),SUM(P169:INDEX(P169:P273,MATCH(TRUE,(B169:B273=\"Start&End\"),0))),SUM(P169:INDEX(P169:P273,MATCH(TRUE,(B169:B273=\"End\"),0)))))","v":""},{"$f":"IF(C169=\"\",\"\",IF(ISNUMBER(SEARCH(\"Start&End\",B169)),SUM(Q169:INDEX(Q169:Q273,MATCH(TRUE,(B169:B273=\"Start&End\"),0))),SUM(Q169:INDEX(Q169:Q273,MATCH(TRUE,(B169:B273=\"End\"),0)))))","v":""},"",null,null,null,null,null,null,"","","","","","","","",null,"","","","","","","",null,"","","","","","","",null,"","","","","","","",null,"","","","","","",""]
[168,null,null,null,null,null,null,null,null,null,null,null,"","","","","",{"$f":"IF(C170=\"\",\"\",IF(ISNUMBER(SEARCH(\"Start&End\",B170)),SUM(P170:INDEX(P170:P274,MATCH(TRUE,(B170:B274=\"Start&End\"),0))),SUM(P170:INDEX(P170:P274,MATCH(TRUE,(B170:B274=\"End\"),0)))))","v":""},{"$f":"IF(C170=\"\",\"\",IF(ISNUMBER(SEARCH(\"Start&End\",B170)),SUM(Q170:INDEX(Q170:Q274,MATCH(TRUE,(B170:B274=\"Start&End\"),0))),SUM(Q170:INDEX(Q170:Q274,MATCH(TRUE,(B170:B274=\"End\"),0)))))","v":""},"",null,null,null,null,null,null,"","","","","","","","",null,"","","","","","","",null,"","","","","","","",null,"","","","","","","",null,"","","","","","",""]
[169,null,null,null,null,null,null,null,null,null,null,null,"","","","","",{"$f":"IF(C171=\"\",\"\",IF(ISNUMBER(SEARCH(\"Start&End\",B171)),SUM(P171:INDEX(P171:P275,MATCH(TRUE,(B171:B275=\"Start&End\"),0))),SUM(P171:INDEX(P171:P275,MATCH(TRUE,(B171:B275=\"End\"),0)))))","v":""},{"$f":"IF(C171=\"\",\"\",IF(ISNUMBER(SEARCH(\"Start&End\",B171)),SUM(Q171:INDEX(Q171:Q275,MATCH(TRUE,(B171:B275=\"Start&End\"),0))),SUM(Q171:INDEX(Q171:Q275,MATCH(TRUE,(B171:B275=\"End\"),0)))))","v":""},"",null,null,null,null,null,null,"","","","","","","","",null,"","","","","","","",null,"","","","","","","",null,"","","","","","","",null,"","","","","","",""]
[170,null,null,null,null,null,null,null,null,null,null,null,"","","","","",{"$f":"IF(C172=\"\",\"\",IF(ISNUMBER(SEARCH(\"Start&End\",B172)),SUM(P172:INDEX(P172:P276,MATCH(TRUE,(B172:B276=\"Start&End\"),0))),SUM(P172:INDEX(P172:P276,MATCH(TRUE,(B172:B276=\"End\"),0)))))","v":""},{"$f":"IF(C172=\"\",\"\",IF(ISNUMBER(SEARCH(\"Start&End\",B172)),SUM(Q172:INDEX(Q172:Q276,MATCH(TRUE,(B172:B276=\"Start&End\"),0))),SUM(Q172:INDEX(Q172:Q276,MATCH(TRUE,(B172:B276=\"End\"),0)))))","v":""},"",null,null,null,null,null,null,"","","","","","","","",null,"","","","","","","",null,"","","","","","","",null,"","","","","","","",null,"","","","","","",""]
[171,null,null,null,null,null,null,null,null,null,null,null,"","","","","",{"$f":"IF(C173=\"\",\"\",IF(ISNUMBER(SEARCH(\"Start&End\",B173)),SUM(P173:INDEX(P173:P277,MATCH(TRUE,(B173:B277=\"Start&End\"),0))),SUM(P173:INDEX(P173:P277,MATCH(TRUE,(B173:B277=\"End\"),0)))))","v":""},{"$f":"IF(C173=\"\",\"\",IF(ISNUMBER(SEARCH(\"Start&End\",B173)),SUM(Q173:INDEX(Q173:Q277,MATCH(TRUE,(B173:B277=\"Start&End\"),0))),SUM(Q173:INDEX(Q173:Q277,MATCH(TRUE,(B173:B277=\"End\"),0)))))","v":""},"",null,null,null,null,null,null,"","","","","","","","",null,"","","","","","","",null,"","","","","","","",null,"","","","","","","",null,"","","","","","",""]
[172,null,null,null,null,null,null,null,null,null,null,null,"","","","","",{"$f":"IF(C174=\"\",\"\",IF(ISNUMBER(SEARCH(\"Start&End\",B174)),SUM(P174:INDEX(P174:P278,MATCH(TRUE,(B174:B278=\"Start&End\"),0))),SUM(P174:INDEX(P174:P278,MATCH(TRUE,(B174:B278=\"End\"),0)))))","v":""},{"$f":"IF(C174=\"\",\"\",IF(ISNUMBER(SEARCH(\"Start&End\",B174)),SUM(Q174:INDEX(Q174:Q278,MATCH(TRUE,(B174:B278=\"Start&End\"),0))),SUM(Q174:INDEX(Q174:Q278,MATCH(TRUE,(B174:B278=\"End\"),0)))))","v":""},"",null,null,null,null,null,null,"","","","","","","","",null,"","","","","","","",null,"","","","","","","",null,"","","","","","","",null,"","","","","","",""]
[173,null,null,null,null,null,null,null,null,null,null,null,"","","","","",{"$f":"IF(C175=\"\",\"\",IF(ISNUMBER(SEARCH(\"Start&End\",B175)),SUM(P175:INDEX(P175:P279,MATCH(TRUE,(B175:B279=\"Start&End\"),0))),SUM(P175:INDEX(P175:P279,MATCH(TRUE,(B175:B279=\"End\"),0)))))","v":""},{"$f":"IF(C175=\"\",\"\",IF(ISNUMBER(SEARCH(\"Start&End\",B175)),SUM(Q175:INDEX(Q175:Q279,MATCH(TRUE,(B175:B279=\"Start&End\"),0))),SUM(Q175:INDEX(Q175:Q279,MATCH(TRUE,(B175:B279=\"End\"),0)))))","v":""},"",null,null,null,null,null,null,"","","","","","","","",null,"","","","","","","",null,"","","","","","","",null,"","","","","","","",null,"","","","","","",""]
[174,null,null,null,null,null,null,null,null,null,null,null,"","","","","",{"$f":"IF(C176=\"\",\"\",IF(ISNUMBER(SEARCH(\"Start&End\",B176)),SUM(P176:INDEX(P176:P280,MATCH(TRUE,(B176:B280=\"Start&End\"),0))),SUM(P176:INDEX(P176:P280,MATCH(TRUE,(B176:B280=\"End\"),0)))))","v":""},{"$f":"IF(C176=\"\",\"\",IF(ISNUMBER(SEARCH(\"Start&End\",B176)),SUM(Q176:INDEX(Q176:Q280,MATCH(TRUE,(B176:B280=\"Start&End\"),0))),SUM(Q176:INDEX(Q176:Q280,MATCH(TRUE,(B176:B280=\"End\"),0)))))","v":""},"",null,null,null,null,null,null,"","","","","","","","",null,"","","","","","","",null,"","","","","","","",null,"","","","","","","",null,"","","","","","",""]
[175,null,null,null,null,null,null,null,null,null,null,null,"","","","","",{"$f":"IF(C177=\"\",\"\",IF(ISNUMBER(SEARCH(\"Start&End\",B177)),SUM(P177:INDEX(P177:P281,MATCH(TRUE,(B177:B281=\"Start&End\"),0))),SUM(P177:INDEX(P177:P281,MATCH(TRUE,(B177:B281=\"End\"),0)))))","v":""},{"$f":"IF(C177=\"\",\"\",IF(ISNUMBER(SEARCH(\"Start&End\",B177)),SUM(Q177:INDEX(Q177:Q281,MATCH(TRUE,(B177:B281=\"Start&End\"),0))),SUM(Q177:INDEX(Q177:Q281,MATCH(TRUE,(B177:B281=\"End\"),0)))))","v":""},"",null,null,null,null,null,null,"","","","","","","","",null,"","","","","","","",null,"","","","","","","",null,"","","","","","","",null,"","","","","","",""]
[176,null,null,null,null,null,null,null,null,null,null,null,"","","","","",{"$f":"IF(C178=\"\",\"\",IF(ISNUMBER(SEARCH(\"Start&End\",B178)),SUM(P178:INDEX(P178:P282,MATCH(TRUE,(B178:B282=\"Start&End\"),0))),SUM(P178:INDEX(P178:P282,MATCH(TRUE,(B178:B282=\"End\"),0)))))","v":""},{"$f":"IF(C178=\"\",\"\",IF(ISNUMBER(SEARCH(\"Start&End\",B178)),SUM(Q178:INDEX(Q178:Q282,MATCH(TRUE,(B178:B282=\"Start&End\"),0))),SUM(Q178:INDEX(Q178:Q282,MATCH(TRUE,(B178:B282=\"End\"),0)))))","v":""},"",null,null,null,null,null,null,"","","","","","","","",null,"","","","","","","",null,"","","","","","","",null,"","","","","","","",null,"","","","","","",""]
[177,null,null,null,null,null,null,null,null,null,null,null,"","","","","",{"$f":"IF(C179=\"\",\"\",IF(ISNUMBER(SEARCH(\"Start&End\",B179)),SUM(P179:INDEX(P179:P283,MATCH(TRUE,(B179:B283=\"Start&End\"),0))),SUM(P179:INDEX(P179:P283,MATCH(TRUE,(B179:B283=\"End\"),0)))))","v":""},{"$f":"IF(C179=\"\",\"\",IF(ISNUMBER(SEARCH(\"Start&End\",B179)),SUM(Q179:INDEX(Q179:Q283,MATCH(TRUE,(B179:B283=\"Start&End\"),0))),SUM(Q179:INDEX(Q179:Q283,MATCH(TRUE,(B179:B283=\"End\"),0)))))","v":""},"",null,null,null,null,null,null,"","","","","","","","",null,"","","","","","","",null,"","","","","","","",null,"","","","","","","",null,"","","","","","",""]
[178,null,null,null,null,null,null,null,null,null,null,null,"","","","","",{"$f":"IF(C180=\"\",\"\",IF(ISNUMBER(SEARCH(\"Start&End\",B180)),SUM(P180:INDEX(P180:P284,MATCH(TRUE,(B180:B284=\"Start&End\"),0))),SUM(P180:INDEX(P180:P284,MATCH(TRUE,(B180:B284=\"End\"),0)))))","v":""},{"$f":"IF(C180=\"\",\"\",IF(ISNUMBER(SEARCH(\"Start&End\",B180)),SUM(Q180:INDEX(Q180:Q284,MATCH(TRUE,(B180:B284=\"Start&End\"),0))),SUM(Q180:INDEX(Q180:Q284,MATCH(TRUE,(B180:B284=\"End\"),0)))))","v":""},"",null,null,null,null,null,null,"","","","","","","","",null,"","","","","","","",null,"","","","","","","",null,"","","","","","","",null,"","","","","","",""]
[179,null,null,null,null,null,null,null,null,null,null,null,"","","","","",{"$f":"IF(C181=\"\",\"\",IF(ISNUMBER(SEARCH(\"Start&End\",B181)),SUM(P181:INDEX(P181:P285,MATCH(TRUE,(B181:B285=\"Start&End\"),0))),SUM(P181:INDEX(P181:P285,MATCH(TRUE,(B181:B285=\"End\"),0)))))","v":""},{"$f":"IF(C181=\"\",\"\",IF(ISNUMBER(SEARCH(\"Start&End\",B181)),SUM(Q181:INDEX(Q181:Q285,MATCH(TRUE,(B181:B285=\"Start&End\"),0))),SUM(Q181:INDEX(Q181:Q285,MATCH(TRUE,(B181:B285=\"End\"),0)))))","v":""},"",null,null,null,null,null,null,"","","","","","","","",null,"","","","","","","",null,"","","","","","","",null,"","","","","","","",null,"","","","","","",""]
[180,null,null,null,null,null,null,null,null,null,null,null,"","","","","",{"$f":"IF(C182=\"\",\"\",IF(ISNUMBER(SEARCH(\"Start&End\",B182)),SUM(P182:INDEX(P182:P286,MATCH(TRUE,(B182:B286=\"Start&End\"),0))),SUM(P182:INDEX(P182:P286,MATCH(TRUE,(B182:B286=\"End\"),0)))))","v":""},{"$f":"IF(C182=\"\",\"\",IF(ISNUMBER(SEARCH(\"Start&End\",B182)),SUM(Q182:INDEX(Q182:Q286,MATCH(TRUE,(B182:B286=\"Start&End\"),0))),SUM(Q182:INDEX(Q182:Q286,MATCH(TRUE,(B182:B286=\"End\"),0)))))","v":""},"",null,null,null,null,null,null,"","","","","","","","",null,"","","","","","","",null,"","","","","","","",null,"","","","","","","",null,"","","","","","",""]
[181,null,null,null,null,null,null,null,null,null,null,null,"","","","","",{"$f":"IF(C183=\"\",\"\",IF(ISNUMBER(SEARCH(\"Start&End\",B183)),SUM(P183:INDEX(P183:P287,MATCH(TRUE,(B183:B287=\"Start&End\"),0))),SUM(P183:INDEX(P183:P287,MATCH(TRUE,(B183:B287=\"End\"),0)))))","v":""},{"$f":"IF(C183=\"\",\"\",IF(ISNUMBER(SEARCH(\"Start&End\",B183)),SUM(Q183:INDEX(Q183:Q287,MATCH(TRUE,(B183:B287=\"Start&End\"),0))),SUM(Q183:INDEX(Q183:Q287,MATCH(TRUE,(B183:B287=\"End\"),0)))))","v":""},"",null,null,null,null,null,null,"","","","","","","","",null,"","","","","","","",null,"","","","","","","",null,"","","","","","","",null,"","","","","","",""]
[182,null,null,null,null,null,null,null,null,null,null,null,"","","","","",{"$f":"IF(C184=\"\",\"\",IF(ISNUMBER(SEARCH(\"Start&End\",B184)),SUM(P184:INDEX(P184:P288,MATCH(TRUE,(B184:B288=\"Start&End\"),0))),SUM(P184:INDEX(P184:P288,MATCH(TRUE,(B184:B288=\"End\"),0)))))","v":""},{"$f":"IF(C184=\"\",\"\",IF(ISNUMBER(SEARCH(\"Start&End\",B184)),SUM(Q184:INDEX(Q184:Q288,MATCH(TRUE,(B184:B288=\"Start&End\"),0))),SUM(Q184:INDEX(Q184:Q288,MATCH(TRUE,(B184:B288=\"End\"),0)))))","v":""},"",null,null,null,null,null,null,"","","","","","","","",null,"","","","","","","",null,"","","","","","","",null,"","","","","","","",null,"","","","","","",""]
[183,null,null,null,null,null,null,null,null,null,null,null,"","","","","",{"$f":"IF(C185=\"\",\"\",IF(ISNUMBER(SEARCH(\"Start&End\",B185)),SUM(P185:INDEX(P185:P289,MATCH(TRUE,(B185:B289=\"Start&End\"),0))),SUM(P185:INDEX(P185:P289,MATCH(TRUE,(B185:B289=\"End\"),0)))))","v":""},{"$f":"IF(C185=\"\",\"\",IF(ISNUMBER(SEARCH(\"Start&End\",B185)),SUM(Q185:INDEX(Q185:Q289,MATCH(TRUE,(B185:B289=\"Start&End\"),0))),SUM(Q185:INDEX(Q185:Q289,MATCH(TRUE,(B185:B289=\"End\"),0)))))","v":""},"",null,null,null,null,null,null,"","","","","","","","",null,"","","","","","","",null,"","","","","","","",null,"","","","","","","",null,"","","","","","",""]
[184,null,null,null,null,null,null,null,null,null,null,null,"","","","","",{"$f":"IF(C186=\"\",\"\",IF(ISNUMBER(SEARCH(\"Start&End\",B186)),SUM(P186:INDEX(P186:P290,MATCH(TRUE,(B186:B290=\"Start&End\"),0))),SUM(P186:INDEX(P186:P290,MATCH(TRUE,(B186:B290=\"End\"),0)))))","v":""},{"$f":"IF(C186=\"\",\"\",IF(ISNUMBER(SEARCH(\"Start&End\",B186)),SUM(Q186:INDEX(Q186:Q290,MATCH(TRUE,(B186:B290=\"Start&End\"),0))),SUM(Q186:INDEX(Q186:Q290,MATCH(TRUE,(B186:B290=\"End\"),0)))))","v":""},"",null,null,null,null,null,null,"","","","","","","","",null,"","","","","","","",null,"","","","","","","",null,"","","","","","","",null,"","","","","","",""]
[185,null,null,null,null,null,null,null,null,null,null,null,"","","","","",{"$f":"IF(C187=\"\",\"\",IF(ISNUMBER(SEARCH(\"Start&End\",B187)),SUM(P187:INDEX(P187:P291,MATCH(TRUE,(B187:B291=\"Start&End\"),0))),SUM(P187:INDEX(P187:P291,MATCH(TRUE,(B187:B291=\"End\"),0)))))","v":""},{"$f":"IF(C187=\"\",\"\",IF(ISNUMBER(SEARCH(\"Start&End\",B187)),SUM(Q187:INDEX(Q187:Q291,MATCH(TRUE,(B187:B291=\"Start&End\"),0))),SUM(Q187:INDEX(Q187:Q291,MATCH(TRUE,(B187:B291=\"End\"),0)))))","v":""},"",null,null,null,null,null,null,"","","","","","","","",null,"","","","","","","",null,"","","","","","","",null,"","","","","","","",null,"","","","","","",""]
[186,null,null,null,null,null,null,null,null,null,null,null,"","","","","",{"$f":"IF(C188=\"\",\"\",IF(ISNUMBER(SEARCH(\"Start&End\",B188)),SUM(P188:INDEX(P188:P292,MATCH(TRUE,(B188:B292=\"Start&End\"),0))),SUM(P188:INDEX(P188:P292,MATCH(TRUE,(B188:B292=\"End\"),0)))))","v":""},{"$f":"IF(C188=\"\",\"\",IF(ISNUMBER(SEARCH(\"Start&End\",B188)),SUM(Q188:INDEX(Q188:Q292,MATCH(TRUE,(B188:B292=\"Start&End\"),0))),SUM(Q188:INDEX(Q188:Q292,MATCH(TRUE,(B188:B292=\"End\"),0)))))","v":""},"",null,null,null,null,null,null,"","","","","","","","",null,"","","","","","","",null,"","","","","","","",null,"","","","","","","",null,"","","","","","",""]
[187,null,null,null,null,null,null,null,null,null,null,null,"","","","","",{"$f":"IF(C189=\"\",\"\",IF(ISNUMBER(SEARCH(\"Start&End\",B189)),SUM(P189:INDEX(P189:P293,MATCH(TRUE,(B189:B293=\"Start&End\"),0))),SUM(P189:INDEX(P189:P293,MATCH(TRUE,(B189:B293=\"End\"),0)))))","v":""},{"$f":"IF(C189=\"\",\"\",IF(ISNUMBER(SEARCH(\"Start&End\",B189)),SUM(Q189:INDEX(Q189:Q293,MATCH(TRUE,(B189:B293=\"Start&End\"),0))),SUM(Q189:INDEX(Q189:Q293,MATCH(TRUE,(B189:B293=\"End\"),0)))))","v":""},"",null,null,null,null,null,null,"","","","","","","","",null,"","","","","","","",null,"","","","","","","",null,"","","","","","","",null,"","","","","","",""]
[188,null,null,null,null,null,null,null,null,null,null,null,"","","","","",{"$f":"IF(C190=\"\",\"\",IF(ISNUMBER(SEARCH(\"Start&End\",B190)),SUM(P190:INDEX(P190:P294,MATCH(TRUE,(B190:B294=\"Start&End\"),0))),SUM(P190:INDEX(P190:P294,MATCH(TRUE,(B190:B294=\"End\"),0)))))","v":""},{"$f":"IF(C190=\"\",\"\",IF(ISNUMBER(SEARCH(\"Start&End\",B190)),SUM(Q190:INDEX(Q190:Q294,MATCH(TRUE,(B190:B294=\"Start&End\"),0))),SUM(Q190:INDEX(Q190:Q294,MATCH(TRUE,(B190:B294=\"End\"),0)))))","v":""},"",null,null,null,null,null,null,"","","","","","","","",null,"","","","","","","",null,"","","","","","","",null,"","","","","","","",null,"","","","","","",""]
[189,null,null,null,null,null,null,null,null,null,null,null,"","","","","",{"$f":"IF(C191=\"\",\"\",IF(ISNUMBER(SEARCH(\"Start&End\",B191)),SUM(P191:INDEX(P191:P295,MATCH(TRUE,(B191:B295=\"Start&End\"),0))),SUM(P191:INDEX(P191:P295,MATCH(TRUE,(B191:B295=\"End\"),0)))))","v":""},{"$f":"IF(C191=\"\",\"\",IF(ISNUMBER(SEARCH(\"Start&End\",B191)),SUM(Q191:INDEX(Q191:Q295,MATCH(TRUE,(B191:B295=\"Start&End\"),0))),SUM(Q191:INDEX(Q191:Q295,MATCH(TRUE,(B191:B295=\"End\"),0)))))","v":""},"",null,null,null,null,null,null,"","","","","","","","",null,"","","","","","","",null,"","","","","","","",null,"","","","","","","",null,"","","","","","",""]
[190,null,null,null,null,null,null,null,null,null,null,null,"","","","","",{"$f":"IF(C192=\"\",\"\",IF(ISNUMBER(SEARCH(\"Start&End\",B192)),SUM(P192:INDEX(P192:P296,MATCH(TRUE,(B192:B296=\"Start&End\"),0))),SUM(P192:INDEX(P192:P296,MATCH(TRUE,(B192:B296=\"End\"),0)))))","v":""},{"$f":"IF(C192=\"\",\"\",IF(ISNUMBER(SEARCH(\"Start&End\",B192)),SUM(Q192:INDEX(Q192:Q296,MATCH(TRUE,(B192:B296=\"Start&End\"),0))),SUM(Q192:INDEX(Q192:Q296,MATCH(TRUE,(B192:B296=\"End\"),0)))))","v":""},"",null,null,null,null,null,null,"","","","","","","","",null,"","","","","","","",null,"","","","","","","",null,"","","","","","","",null,"","","","","","",""]
[191,null,null,null,null,null,null,null,null,null,null,null,"","","","","",{"$f":"IF(C193=\"\",\"\",IF(ISNUMBER(SEARCH(\"Start&End\",B193)),SUM(P193:INDEX(P193:P297,MATCH(TRUE,(B193:B297=\"Start&End\"),0))),SUM(P193:INDEX(P193:P297,MATCH(TRUE,(B193:B297=\"End\"),0)))))","v":""},{"$f":"IF(C193=\"\",\"\",IF(ISNUMBER(SEARCH(\"Start&End\",B193)),SUM(Q193:INDEX(Q193:Q297,MATCH(TRUE,(B193:B297=\"Start&End\"),0))),SUM(Q193:INDEX(Q193:Q297,MATCH(TRUE,(B193:B297=\"End\"),0)))))","v":""},"",null,null,null,null,null,null,"","","","","","","","",null,"","","","","","","",null,"","","","","","","",null,"","","","","","","",null,"","","","","","",""]
[192,null,null,null,null,null,null,null,null,null,null,null,"","","","","",{"$f":"IF(C194=\"\",\"\",IF(ISNUMBER(SEARCH(\"Start&End\",B194)),SUM(P194:INDEX(P194:P298,MATCH(TRUE,(B194:B298=\"Start&End\"),0))),SUM(P194:INDEX(P194:P298,MATCH(TRUE,(B194:B298=\"End\"),0)))))","v":""},{"$f":"IF(C194=\"\",\"\",IF(ISNUMBER(SEARCH(\"Start&End\",B194)),SUM(Q194:INDEX(Q194:Q298,MATCH(TRUE,(B194:B298=\"Start&End\"),0))),SUM(Q194:INDEX(Q194:Q298,MATCH(TRUE,(B194:B298=\"End\"),0)))))","v":""},"",null,null,null,null,null,null,"","","","","","","","",null,"","","","","","","",null,"","","","","","","",null,"","","","","","","",null,"","","","","","",""]
[193,null,null,null,null,null,null,null,null,null,null,null,"","","","",{"$f":"IF(AA195=\"\",\"\",O195-P195)","v":""},{"$f":"IF(C195=\"\",\"\",IF(ISNUMBER(SEARCH(\"Start&End\",B195)),SUM(P195:INDEX(P195:P299,MATCH(TRUE,(B195:B299=\"Start&End\"),0))),SUM(P195:INDEX(P195:P299,MATCH(TRUE,(B195:B299=\"End\"),0)))))","v":""},{"$f":"IF(C195=\"\",\"\",IF(ISNUMBER(SEARCH(\"Start&End\",B195)),SUM(Q195:INDEX(Q195:Q299,MATCH(TRUE,(B195:B299=\"Start&End\"),0))),SUM(Q195:INDEX(Q195:Q299,MATCH(TRUE,(B195:B299=\"End\"),0)))))","v":""},{"$f":"IF(ISNUMBER(S195),S195,\"\")","v":""},null,null,null,null,null,null,{"$f":"IF((H195+I195)*G195=0,\"\",(H195+I195)*G195)","v":""},{"$f":"IF(ISNUMBER(SEARCH(\"FUT\",E195)),AZ195,IF(ISNUMBER(SEARCH(\"OPT\",E195)),BH195,IF(ISNUMBER(SEARCH(\"HOLD\",E195)),AJ195,AR195)))","v":""},{"$f":"IF(ISNUMBER(SEARCH(\"HOLD\",E195)),AK195,IF(ISNUMBER(SEARCH(\"INTRA\",E195)),AS195,IF(ISNUMBER(SEARCH(\"FUT\",E195)),BA195,BI195)))","v":""},{"$f":"IF(ISNUMBER(SEARCH(\"HOLD\",E195)),AL195,IF(ISNUMBER(SEARCH(\"INTRA\",E195)),AT195,IF(ISNUMBER(SEARCH(\"FUT\",E195)),BB195,BJ195)))","v":""},{"$f":"IF(ISNUMBER(SEARCH(\"HOLD\",E195)),AM195,IF(ISNUMBER(SEARCH(\"INTRA\",E195)),AU195,IF(ISNUMBER(SEARCH(\"FUT\",E195)),BC195,BK195)))","v":""},{"$f":"IF(ISNUMBER(SEARCH(\"HOLD\",E195)),AN195,IF(ISNUMBER(SEARCH(\"INTRA\",E195)),AV195,IF(ISNUMBER(SEARCH(\"FUT\",E195)),BD195,BL195)))","v":""},{"$f":"IF(ISNUMBER(SEARCH(\"HOLD\",E195)),AO195,IF(ISNUMBER(SEARCH(\"INTRA\",E195)),AW195,IF(ISNUMBER(SEARCH(\"FUT\",E195)),BE195,BM195)))","v":""},"",null,"","","","","",{"$f":"IF(G195&H195=\"\",\"\",ROUND(G195*H195*0.00015,2))","v":""},"",null,{"$f":"IF(MIN(20,((G195*H195*0.0003)))+MIN(20,((G195*H195*0.0003)))=0,\"\",MIN(20,((G195*H195*0.0003)))+MIN(20,((G195*H195*0.0003))))","v":""},{"$f":"IF(I195&G195=\"\",\"\",ROUND(I195*G195*0.00025,0))","v":""},"","","",{"$f":"IF(G195&H195=\"\",\"\",ROUND(G195*H195*0.00003,2))","v":""},"",null,{"$f":"IF(MIN(20,((G195*H195*0.0003)))+MIN(20,((G195*H195*0.0003)))=0,\"\",MIN(20,((G195*H195*0.0003)))+MIN(20,((G195*H195*0.0003))))","v":""},{"$f":"IF(I195&G195=\"\",\"\",ROUND(I195*G195*0.0001,0))","v":""},"","","",{"$f":"IF(G195&H195=\"\",\"\",ROUND(G195*H195*0.00002,2))","v":""},"",null,{"$f":"IF(AA195=\"\",\"\",40)","v":""},{"$f":"IF(I195&G195=\"\",\"\",ROUND(I195*G195*0.0005,0))","v":""},{"$f":"IF(AA195=\"\",\"\",ROUND(AA195*0.00053,2))","v":""},"",{"$f":"IF(AA195=\"\",\"\",ROUND((5/10000000)*AA195,2))","v":""},{"$f":"IF(G195&H195=\"\",\"\",ROUND(G195*H195*0.00003,2))","v":""},""]
[194,null,null,null,null,null,null,null,null,null,null,null,{"$f":"IF(OR(J196=\"\",K196=\"\"),\"\",IF(F196=\"Long\",  ((K196-H196)/(H196-J196)), ((I196-K196)/(J196-I196)) ))","v":""},{"$f":"IF(OR(I196=\"\",D196=\"\",H196=\"\",G196=\"\",E196=\"\",K196=\"\"),\"\",IF(I196=K196,\"Target Achieved\",IF(I196=J196,\"SL Hit\",IF(I196<J196,\"Extended SL Hit\",IF(I196>K196,\"Target Overachieved\",IF(AND(I196>=H196,I196<K196),\"Early Profit Exit\",\"Early Loss Exit\"))))))","v":""},{"$f":"IF(AA196=\"\",\"\",IF(OR(I196=\"\",H196=\"\"),0,G196*(I196-H196)))","v":""},{"$f":"IF(AH196=\"\",\"\",AH196)","v":""},"",{"$f":"IF(C196=\"\",\"\",IF(ISNUMBER(SEARCH(\"Start&End\",B196)),SUM(P196:INDEX(P196:P300,MATCH(TRUE,(B196:B300=\"Start&End\"),0))),SUM(P196:INDEX(P196:P300,MATCH(TRUE,(B196:B300=\"End\"),0)))))","v":""},{"$f":"IF(C196=\"\",\"\",IF(ISNUMBER(SEARCH(\"Start&End\",B196)),SUM(Q196:INDEX(Q196:Q300,MATCH(TRUE,(B196:B300=\"Start&End\"),0))),SUM(Q196:INDEX(Q196:Q300,MATCH(TRUE,(B196:B300=\"End\"),0)))))","v":""},"",null,null,null,null,null,null,"","","","","","","",{"$f":"IF(AB196&AC196&AD196&AE196&AF196&AG196=\"\",\"\",SUM(AB196:AG196))","v":""},null,{"$f":"IF(AA196=\"\",\"\",0)","v":""},{"$f":"IF(AA196=\"\",\"\",ROUND(AA196*0.001,2))","v":""},{"$f":"IF(AA196=\"\",\"\",ROUND(AA196*0.0000345,2))","v":""},{"$f":"IF(AJ196&AL196=\"\",\"\",ROUND((AJ196+AL196)*0.18,2))","v":""},{"$f":"IF(AA196=\"\",\"\",ROUND((5/10000000)*AA196,2))","v":""},"",{"$f":"IF(AK196&AL196&AM196&AN196&AO196=\"\",\"\",SUM(AK196:AO196))","v":""},null,"","",{"$f":"IF(AA196=\"\",\"\",ROUND(AA196*0.0000345,2))","v":""},{"$f":"IF(AR196&AT196=\"\",\"\",ROUND((AR196+AT196)*0.18,2))","v":""},{"$f":"IF(AA196=\"\",\"\",ROUND((5/10000000)*AA196,2))","v":""},"",{"$f":"IF(AR196&AS196&AT196&AU196&AV196&AW196=\"\",\"\",SUM(AR196:AW196))","v":""},null,"","",{"$f":"IF(AA196=\"\",\"\",ROUND(AA196*0.00002,2))","v":""},{"$f":"IF(AZ196&BB196=\"\",\"\",ROUND((AZ196+BB196)*0.18,2))","v":""},{"$f":"IF(AA196=\"\",\"\",ROUND((5/10000000)*AA196,2))","v":""},"","",null,"","","",{"$f":"IF(BH196&BJ196=\"\",\"\",ROUND((BH196+BJ196)*0.18,2))","v":""},"","",{"$f":"IF(BH196&BI196&BJ196&BK196&BL196&BM196=\"\",\"\",SUM(BH196:BM196))","v":""}]
[195,null,null,null,null,null,null,null,null,null,null,null,"","","","","",{"$f":"IF(C197=\"\",\"\",IF(ISNUMBER(SEARCH(\"Start&End\",B197)),SUM(P197:INDEX(P197:P301,MATCH(TRUE,(B197:B301=\"Start&End\"),0))),SUM(P197:INDEX(P197:P301,MATCH(TRUE,(B197:B301=\"End\"),0)))))","v":""},{"$f":"IF(C197=\"\",\"\",IF(ISNUMBER(SEARCH(\"Start&End\",B197)),SUM(Q197:INDEX(Q197:Q301,MATCH(TRUE,(B197:B301=\"Start&End\"),0))),SUM(Q197:INDEX(Q197:Q301,MATCH(TRUE,(B197:B301=\"End\"),0)))))","v":""},"",null,null,null,null,null,null,"","","","","","","","",null,"","","","","","","",null,"","","","","","","",null,"","","","","","",{"$f":"IF(FAX197&BA197&BB197&BC197&BD197&BE197=\"\",\"\",SUM(AZ197:BE197))","v":""},null,"","","","","","",""]
[196,null,null,null,null,null,null,null,null,null,null,null,"","","","","",{"$f":"IF(C198=\"\",\"\",IF(ISNUMBER(SEARCH(\"Start&End\",B198)),SUM(P198:INDEX(P198:P302,MATCH(TRUE,(B198:B302=\"Start&End\"),0))),SUM(P198:INDEX(P198:P302,MATCH(TRUE,(B198:B302=\"End\"),0)))))","v":""},{"$f":"IF(C198=\"\",\"\",IF(ISNUMBER(SEARCH(\"Start&End\",B198)),SUM(Q198:INDEX(Q198:Q302,MATCH(TRUE,(B198:B302=\"Start&End\"),0))),SUM(Q198:INDEX(Q198:Q302,MATCH(TRUE,(B198:B302=\"End\"),0)))))","v":""},"",null,null,null,null,null,null,"","","","","","","","",null,"","","","","","","",null,"","","","","","","",null,"","","","","","","",null,"","","","","","",""]
[197,null,null,null,null,null,null,null,null,null,null,null,"","","","","",{"$f":"IF(C199=\"\",\"\",IF(ISNUMBER(SEARCH(\"Start&End\",B199)),SUM(P199:INDEX(P199:P303,MATCH(TRUE,(B199:B303=\"Start&End\"),0))),SUM(P199:INDEX(P199:P303,MATCH(TRUE,(B199:B303=\"End\"),0)))))","v":""},{"$f":"IF(C199=\"\",\"\",IF(ISNUMBER(SEARCH(\"Start&End\",B199)),SUM(Q199:INDEX(Q199:Q303,MATCH(TRUE,(B199:B303=\"Start&End\"),0))),SUM(Q199:INDEX(Q199:Q303,MATCH(TRUE,(B199:B303=\"End\"),0)))))","v":""},"",null,null,null,null,null,null,"","","","","","","","",null,"","","","","","","",null,"","","","","","","",null,"","","","","","","",null,"","","","","","",""]
[198,null,null,null,null,null,null,null,null,null,null,null,"","","","","",{"$f":"IF(C200=\"\",\"\",IF(ISNUMBER(SEARCH(\"Start&End\",B200)),SUM(P200:INDEX(P200:P304,MATCH(TRUE,(B200:B304=\"Start&End\"),0))),SUM(P200:INDEX(P200:P304,MATCH(TRUE,(B200:B304=\"End\"),0)))))","v":""},{"$f":"IF(C200=\"\",\"\",IF(ISNUMBER(SEARCH(\"Start&End\",B200)),SUM(Q200:INDEX(Q200:Q304,MATCH(TRUE,(B200:B304=\"Start&End\"),0))),SUM(Q200:INDEX(Q200:Q304,MATCH(TRUE,(B200:B304=\"End\"),0)))))","v":""},"",null,null,null,null,null,null,"","","","","","","","",null,"","","","","","","",null,"","","","","","","",null,"","","","","","","",null,"","","","","","",""]
[199,null,null,null,null,null,null,null,null,null,null,null,"","","","","",{"$f":"IF(C201=\"\",\"\",IF(ISNUMBER(SEARCH(\"Start&End\",B201)),SUM(P201:INDEX(P201:P305,MATCH(TRUE,(B201:B305=\"Start&End\"),0))),SUM(P201:INDEX(P201:P305,MATCH(TRUE,(B201:B305=\"End\"),0)))))","v":""},{"$f":"IF(C201=\"\",\"\",IF(ISNUMBER(SEARCH(\"Start&End\",B201)),SUM(Q201:INDEX(Q201:Q305,MATCH(TRUE,(B201:B305=\"Start&End\"),0))),SUM(Q201:INDEX(Q201:Q305,MATCH(TRUE,(B201:B305=\"End\"),0)))))","v":""},"",null,null,null,null,null,null,"","","","","","","","",null,"","","","","","","",null,"","","","","","","",null,"","","","","","","",null,"","","","","","",""]
[200,null,null,null,null,null,null,null,null,null,null,null,"","","","","",{"$f":"IF(C202=\"\",\"\",IF(ISNUMBER(SEARCH(\"Start&End\",B202)),SUM(P202:INDEX(P202:P306,MATCH(TRUE,(B202:B306=\"Start&End\"),0))),SUM(P202:INDEX(P202:P306,MATCH(TRUE,(B202:B306=\"End\"),0)))))","v":""},{"$f":"IF(C202=\"\",\"\",IF(ISNUMBER(SEARCH(\"Start&End\",B202)),SUM(Q202:INDEX(Q202:Q306,MATCH(TRUE,(B202:B306=\"Start&End\"),0))),SUM(Q202:INDEX(Q202:Q306,MATCH(TRUE,(B202:B306=\"End\"),0)))))","v":""},"",null,null,null,null,null,null,"","","","","","","","",null,"","","","","","","",null,"","","","","","","",null,"","","","","","","",null,"","","","","","",""]
[201,null,null,null,null,null,null,null,null,null,null,null,"","","","","",{"$f":"IF(C203=\"\",\"\",IF(ISNUMBER(SEARCH(\"Start&End\",B203)),SUM(P203:INDEX(P203:P307,MATCH(TRUE,(B203:B307=\"Start&End\"),0))),SUM(P203:INDEX(P203:P307,MATCH(TRUE,(B203:B307=\"End\"),0)))))","v":""},{"$f":"IF(C203=\"\",\"\",IF(ISNUMBER(SEARCH(\"Start&End\",B203)),SUM(Q203:INDEX(Q203:Q307,MATCH(TRUE,(B203:B307=\"Start&End\"),0))),SUM(Q203:INDEX(Q203:Q307,MATCH(TRUE,(B203:B307=\"End\"),0)))))","v":""},"",null,null,null,null,null,null,"","","","","","","","",null,"","","","","","","",null,"","","","","","","",null,"","","","","","","",null,"","","","","","",""]
[202,null,null,null,null,null,null,null,null,null,null,null,"","","","","",{"$f":"IF(C204=\"\",\"\",IF(ISNUMBER(SEARCH(\"Start&End\",B204)),SUM(P204:INDEX(P204:P308,MATCH(TRUE,(B204:B308=\"Start&End\"),0))),SUM(P204:INDEX(P204:P308,MATCH(TRUE,(B204:B308=\"End\"),0)))))","v":""},{"$f":"IF(C204=\"\",\"\",IF(ISNUMBER(SEARCH(\"Start&End\",B204)),SUM(Q204:INDEX(Q204:Q308,MATCH(TRUE,(B204:B308=\"Start&End\"),0))),SUM(Q204:INDEX(Q204:Q308,MATCH(TRUE,(B204:B308=\"End\"),0)))))","v":""},"",null,null,null,null,null,null,"","","","","","","","",null,"","","","","","","",null,"","","","","","","",null,"","","","","","","",null,"","","","","","",""]
[203,null,null,null,null,null,null,null,null,null,null,null,"","","","","",{"$f":"IF(C205=\"\",\"\",IF(ISNUMBER(SEARCH(\"Start&End\",B205)),SUM(P205:INDEX(P205:P309,MATCH(TRUE,(B205:B309=\"Start&End\"),0))),SUM(P205:INDEX(P205:P309,MATCH(TRUE,(B205:B309=\"End\"),0)))))","v":""},{"$f":"IF(C205=\"\",\"\",IF(ISNUMBER(SEARCH(\"Start&End\",B205)),SUM(Q205:INDEX(Q205:Q309,MATCH(TRUE,(B205:B309=\"Start&End\"),0))),SUM(Q205:INDEX(Q205:Q309,MATCH(TRUE,(B205:B309=\"End\"),0)))))","v":""},"",null,null,null,null,null,null,"","","","","","","","",null,"","","","","","","",null,"","","","","","","",null,"","","","","","","",null,"","","","","","",""]
[204,null,null,null,null,null,null,null,null,null,null,null,"","","","","",{"$f":"IF(C206=\"\",\"\",IF(ISNUMBER(SEARCH(\"Start&End\",B206)),SUM(P206:INDEX(P206:P310,MATCH(TRUE,(B206:B310=\"Start&End\"),0))),SUM(P206:INDEX(P206:P310,MATCH(TRUE,(B206:B310=\"End\"),0)))))","v":""},{"$f":"IF(C206=\"\",\"\",IF(ISNUMBER(SEARCH(\"Start&End\",B206)),SUM(Q206:INDEX(Q206:Q310,MATCH(TRUE,(B206:B310=\"Start&End\"),0))),SUM(Q206:INDEX(Q206:Q310,MATCH(TRUE,(B206:B310=\"End\"),0)))))","v":""},"",null,null,null,null,null,null,"","","","","","","","",null,"","","","","","","",null,"","","","","","","",null,"","","","","","","",null,"","","","","","",""]
[205,null,null,null,null,null,null,null,null,null,null,null,"","","","","",{"$f":"IF(C207=\"\",\"\",IF(ISNUMBER(SEARCH(\"Start&End\",B207)),SUM(P207:INDEX(P207:P311,MATCH(TRUE,(B207:B311=\"Start&End\"),0))),SUM(P207:INDEX(P207:P311,MATCH(TRUE,(B207:B311=\"End\"),0)))))","v":""},{"$f":"IF(C207=\"\",\"\",IF(ISNUMBER(SEARCH(\"Start&End\",B207)),SUM(Q207:INDEX(Q207:Q311,MATCH(TRUE,(B207:B311=\"Start&End\"),0))),SUM(Q207:INDEX(Q207:Q311,MATCH(TRUE,(B207:B311=\"End\"),0)))))","v":""},"",null,null,null,null,null,null,"","","","","","","","",null,"","","","","","","",null,"","","","","","","",null,"","","","","","","",null,"","","","","","",""]
[206,null,null,null,null,null,null,null,null,null,null,null,"","","","","",{"$f":"IF(C208=\"\",\"\",IF(ISNUMBER(SEARCH(\"Start&End\",B208)),SUM(P208:INDEX(P208:P312,MATCH(TRUE,(B208:B312=\"Start&End\"),0))),SUM(P208:INDEX(P208:P312,MATCH(TRUE,(B208:B312=\"End\"),0)))))","v":""},{"$f":"IF(C208=\"\",\"\",IF(ISNUMBER(SEARCH(\"Start&End\",B208)),SUM(Q208:INDEX(Q208:Q312,MATCH(TRUE,(B208:B312=\"Start&End\"),0))),SUM(Q208:INDEX(Q208:Q312,MATCH(TRUE,(B208:B312=\"End\"),0)))))","v":""},"",null,null,null,null,null,null,"","","","","","","","",null,"","","","","","","",null,"","","","","","","",null,"","","","","","","",null,"","","","","","",""]
[207,null,null,null,null,null,null,null,null,null,null,null,"","","","","",{"$f":"IF(C209=\"\",\"\",IF(ISNUMBER(SEARCH(\"Start&End\",B209)),SUM(P209:INDEX(P209:P313,MATCH(TRUE,(B209:B313=\"Start&End\"),0))),SUM(P209:INDEX(P209:P313,MATCH(TRUE,(B209:B313=\"End\"),0)))))","v":""},{"$f":"IF(C209=\"\",\"\",IF(ISNUMBER(SEARCH(\"Start&End\",B209)),SUM(Q209:INDEX(Q209:Q313,MATCH(TRUE,(B209:B313=\"Start&End\"),0))),SUM(Q209:INDEX(Q209:Q313,MATCH(TRUE,(B209:B313=\"End\"),0)))))","v":""},"",null,null,null,null,null,null,"","","","","","","","",null,"","","","","","","",null,"","","","","","","",null,"","","","","","","",null,"","","","","","",""]
[208,null,null,null,null,null,null,null,null,null,null,null,"","","","","",{"$f":"IF(C210=\"\",\"\",IF(ISNUMBER(SEARCH(\"Start&End\",B210)),SUM(P210:INDEX(P210:P314,MATCH(TRUE,(B210:B314=\"Start&End\"),0))),SUM(P210:INDEX(P210:P314,MATCH(TRUE,(B210:B314=\"End\"),0)))))","v":""},{"$f":"IF(C210=\"\",\"\",IF(ISNUMBER(SEARCH(\"Start&End\",B210)),SUM(Q210:INDEX(Q210:Q314,MATCH(TRUE,(B210:B314=\"Start&End\"),0))),SUM(Q210:INDEX(Q210:Q314,MATCH(TRUE,(B210:B314=\"End\"),0)))))","v":""},"",null,null,null,null,null,null,"","","","","","","","",null,"","","","","","","",null,"","","","","","","",null,"","","","","","","",null,"","","","","","",""]
[209,null,null,null,null,null,null,null,null,null,null,null,"","","","","",{"$f":"IF(C211=\"\",\"\",IF(ISNUMBER(SEARCH(\"Start&End\",B211)),SUM(P211:INDEX(P211:P315,MATCH(TRUE,(B211:B315=\"Start&End\"),0))),SUM(P211:INDEX(P211:P315,MATCH(TRUE,(B211:B315=\"End\"),0)))))","v":""},{"$f":"IF(C211=\"\",\"\",IF(ISNUMBER(SEARCH(\"Start&End\",B211)),SUM(Q211:INDEX(Q211:Q315,MATCH(TRUE,(B211:B315=\"Start&End\"),0))),SUM(Q211:INDEX(Q211:Q315,MATCH(TRUE,(B211:B315=\"End\"),0)))))","v":""},"",null,null,null,null,null,null,"","","","","","","","",null,"","","","","","","",null,"","","","","","","",null,"","","","","","","",null,"","","","","","",""]
[210,null,null,null,null,null,null,null,null,null,null,null,"","","","","",{"$f":"IF(C212=\"\",\"\",IF(ISNUMBER(SEARCH(\"Start&End\",B212)),SUM(P212:INDEX(P212:P316,MATCH(TRUE,(B212:B316=\"Start&End\"),0))),SUM(P212:INDEX(P212:P316,MATCH(TRUE,(B212:B316=\"End\"),0)))))","v":""},{"$f":"IF(C212=\"\",\"\",IF(ISNUMBER(SEARCH(\"Start&End\",B212)),SUM(Q212:INDEX(Q212:Q316,MATCH(TRUE,(B212:B316=\"Start&End\"),0))),SUM(Q212:INDEX(Q212:Q316,MATCH(TRUE,(B212:B316=\"End\"),0)))))","v":""},"",null,null,null,null,null,null,"","","","","","","","",null,"","","","","","","",null,"","","","","","","",null,"","","","","","","",null,"","","","","","",""]
[211,null,null,null,null,null,null,null,null,null,null,null,"","","","","",{"$f":"IF(C213=\"\",\"\",IF(ISNUMBER(SEARCH(\"Start&End\",B213)),SUM(P213:INDEX(P213:P317,MATCH(TRUE,(B213:B317=\"Start&End\"),0))),SUM(P213:INDEX(P213:P317,MATCH(TRUE,(B213:B317=\"End\"),0)))))","v":""},{"$f":"IF(C213=\"\",\"\",IF(ISNUMBER(SEARCH(\"Start&End\",B213)),SUM(Q213:INDEX(Q213:Q317,MATCH(TRUE,(B213:B317=\"Start&End\"),0))),SUM(Q213:INDEX(Q213:Q317,MATCH(TRUE,(B213:B317=\"End\"),0)))))","v":""},"",null,null,null,null,null,null,"","","","","","","","",null,"","","","","","","",null,"","","","","","","",null,"","","","","","","",null,"","","","","","",""]
[212,null,null,null,null,null,null,null,null,null,null,null,"","","","","",{"$f":"IF(C214=\"\",\"\",IF(ISNUMBER(SEARCH(\"Start&End\",B214)),SUM(P214:INDEX(P214:P318,MATCH(TRUE,(B214:B318=\"Start&End\"),0))),SUM(P214:INDEX(P214:P318,MATCH(TRUE,(B214:B318=\"End\"),0)))))","v":""},{"$f":"IF(C214=\"\",\"\",IF(ISNUMBER(SEARCH(\"Start&End\",B214)),SUM(Q214:INDEX(Q214:Q318,MATCH(TRUE,(B214:B318=\"Start&End\"),0))),SUM(Q214:INDEX(Q214:Q318,MATCH(TRUE,(B214:B318=\"End\"),0)))))","v":""},"",null,null,null,null,null,null,"","","","","","","","",null,"","","","","","","",null,"","","","","","","",null,"","","","","","","",null,"","","","","","",""]
[213,null,null,null,null,null,null,null,null,null,null,null,"","","","","",{"$f":"IF(C215=\"\",\"\",IF(ISNUMBER(SEARCH(\"Start&End\",B215)),SUM(P215:INDEX(P215:P319,MATCH(TRUE,(B215:B319=\"Start&End\"),0))),SUM(P215:INDEX(P215:P319,MATCH(TRUE,(B215:B319=\"End\"),0)))))","v":""},{"$f":"IF(C215=\"\",\"\",IF(ISNUMBER(SEARCH(\"Start&End\",B215)),SUM(Q215:INDEX(Q215:Q319,MATCH(TRUE,(B215:B319=\"Start&End\"),0))),SUM(Q215:INDEX(Q215:Q319,MATCH(TRUE,(B215:B319=\"End\"),0)))))","v":""},"",null,null,null,null,null,null,"","","","","","","","",null,"","","","","","","",null,"","","","","","","",null,"","","","","","","",null,"","","","","","",""]
[214,null,null,null,null,null,null,null,null,null,null,null,"","","","","",{"$f":"IF(C216=\"\",\"\",IF(ISNUMBER(SEARCH(\"Start&End\",B216)),SUM(P216:INDEX(P216:P320,MATCH(TRUE,(B216:B320=\"Start&End\"),0))),SUM(P216:INDEX(P216:P320,MATCH(TRUE,(B216:B320=\"End\"),0)))))","v":""},{"$f":"IF(C216=\"\",\"\",IF(ISNUMBER(SEARCH(\"Start&End\",B216)),SUM(Q216:INDEX(Q216:Q320,MATCH(TRUE,(B216:B320=\"Start&End\"),0))),SUM(Q216:INDEX(Q216:Q320,MATCH(TRUE,(B216:B320=\"End\"),0)))))","v":""},"",null,null,null,null,null,null,"","","","","","","","",null,"","","","","","","",null,"","","","","","","",null,"","","","","","","",null,"","","","","","",""]
[215,null,null,null,null,null,null,null,null,null,null,null,"","","","","",{"$f":"IF(C217=\"\",\"\",IF(ISNUMBER(SEARCH(\"Start&End\",B217)),SUM(P217:INDEX(P217:P321,MATCH(TRUE,(B217:B321=\"Start&End\"),0))),SUM(P217:INDEX(P217:P321,MATCH(TRUE,(B217:B321=\"End\"),0)))))","v":""},{"$f":"IF(C217=\"\",\"\",IF(ISNUMBER(SEARCH(\"Start&End\",B217)),SUM(Q217:INDEX(Q217:Q321,MATCH(TRUE,(B217:B321=\"Start&End\"),0))),SUM(Q217:INDEX(Q217:Q321,MATCH(TRUE,(B217:B321=\"End\"),0)))))","v":""},"",null,null,null,null,null,null,"","","","","","","","",null,"","","","","","","",null,"","","","","","","",null,"","","","","","","",null,"","","","","","",""]
[216,null,null,null,null,null,null,null,null,null,null,null,"","","","","",{"$f":"IF(C218=\"\",\"\",IF(ISNUMBER(SEARCH(\"Start&End\",B218)),SUM(P218:INDEX(P218:P322,MATCH(TRUE,(B218:B322=\"Start&End\"),0))),SUM(P218:INDEX(P218:P322,MATCH(TRUE,(B218:B322=\"End\"),0)))))","v":""},{"$f":"IF(C218=\"\",\"\",IF(ISNUMBER(SEARCH(\"Start&End\",B218)),SUM(Q218:INDEX(Q218:Q322,MATCH(TRUE,(B218:B322=\"Start&End\"),0))),SUM(Q218:INDEX(Q218:Q322,MATCH(TRUE,(B218:B322=\"End\"),0)))))","v":""},"",null,null,null,null,null,null,"","","","","","","","",null,"","","","","","","",null,"","","","","","","",null,"","","","","","","",null,"","","","","","",""]
[217,null,null,null,null,null,null,null,null,null,null,null,"","","","","",{"$f":"IF(C219=\"\",\"\",IF(ISNUMBER(SEARCH(\"Start&End\",B219)),SUM(P219:INDEX(P219:P323,MATCH(TRUE,(B219:B323=\"Start&End\"),0))),SUM(P219:INDEX(P219:P323,MATCH(TRUE,(B219:B323=\"End\"),0)))))","v":""},{"$f":"IF(C219=\"\",\"\",IF(ISNUMBER(SEARCH(\"Start&End\",B219)),SUM(Q219:INDEX(Q219:Q323,MATCH(TRUE,(B219:B323=\"Start&End\"),0))),SUM(Q219:INDEX(Q219:Q323,MATCH(TRUE,(B219:B323=\"End\"),0)))))","v":""},"",null,null,null,null,null,null,"","","","","","","","",null,"","","","","","","",null,"","","","","","","",null,"","","","","","","",null,"","","","","","",""]
[218,null,null,null,null,null,null,null,null,null,null,null,"","","","","",{"$f":"IF(C220=\"\",\"\",IF(ISNUMBER(SEARCH(\"Start&End\",B220)),SUM(P220:INDEX(P220:P324,MATCH(TRUE,(B220:B324=\"Start&End\"),0))),SUM(P220:INDEX(P220:P324,MATCH(TRUE,(B220:B324=\"End\"),0)))))","v":""},{"$f":"IF(C220=\"\",\"\",IF(ISNUMBER(SEARCH(\"Start&End\",B220)),SUM(Q220:INDEX(Q220:Q324,MATCH(TRUE,(B220:B324=\"Start&End\"),0))),SUM(Q220:INDEX(Q220:Q324,MATCH(TRUE,(B220:B324=\"End\"),0)))))","v":""},"",null,null,null,null,null,null,"","","","","","","","",null,"","","","","","","",null,"","","","","","","",null,"","","","","","","",null,"","","","","","",""]
[219,null,null,null,null,null,null,null,null,null,null,null,"","","","","",{"$f":"IF(C221=\"\",\"\",IF(ISNUMBER(SEARCH(\"Start&End\",B221)),SUM(P221:INDEX(P221:P325,MATCH(TRUE,(B221:B325=\"Start&End\"),0))),SUM(P221:INDEX(P221:P325,MATCH(TRUE,(B221:B325=\"End\"),0)))))","v":""},{"$f":"IF(C221=\"\",\"\",IF(ISNUMBER(SEARCH(\"Start&End\",B221)),SUM(Q221:INDEX(Q221:Q325,MATCH(TRUE,(B221:B325=\"Start&End\"),0))),SUM(Q221:INDEX(Q221:Q325,MATCH(TRUE,(B221:B325=\"End\"),0)))))","v":""},"",null,null,null,null,null,null,"","","","","","","","",null,"","","","","","","",null,"","","","","","","",null,"","","","","","","",null,"","","","","","",""]
[220,null,null,null,null,null,null,null,null,null,null,null,"","","","","",{"$f":"IF(C222=\"\",\"\",IF(ISNUMBER(SEARCH(\"Start&End\",B222)),SUM(P222:INDEX(P222:P326,MATCH(TRUE,(B222:B326=\"Start&End\"),0))),SUM(P222:INDEX(P222:P326,MATCH(TRUE,(B222:B326=\"End\"),0)))))","v":""},{"$f":"IF(C222=\"\",\"\",IF(ISNUMBER(SEARCH(\"Start&End\",B222)),SUM(Q222:INDEX(Q222:Q326,MATCH(TRUE,(B222:B326=\"Start&End\"),0))),SUM(Q222:INDEX(Q222:Q326,MATCH(TRUE,(B222:B326=\"End\"),0)))))","v":""},"",null,null,null,null,null,null,"","","","","","","","",null,"","","","","","","",null,"","","","","","","",null,"","","","","","","",null,"","","","","","",""]
[221,null,null,null,null,null,null,null,null,null,null,null,"","","","","",{"$f":"IF(C223=\"\",\"\",IF(ISNUMBER(SEARCH(\"Start&End\",B223)),SUM(P223:INDEX(P223:P327,MATCH(TRUE,(B223:B327=\"Start&End\"),0))),SUM(P223:INDEX(P223:P327,MATCH(TRUE,(B223:B327=\"End\"),0)))))","v":""},{"$f":"IF(C223=\"\",\"\",IF(ISNUMBER(SEARCH(\"Start&End\",B223)),SUM(Q223:INDEX(Q223:Q327,MATCH(TRUE,(B223:B327=\"Start&End\"),0))),SUM(Q223:INDEX(Q223:Q327,MATCH(TRUE,(B223:B327=\"End\"),0)))))","v":""},"",null,null,null,null,null,null,"","","","","","","","",null,"","","","","","","",null,"","","","","","","",null,"","","","","","","",null,"","","","","","",""]
[222,null,null,null,null,null,null,null,null,null,null,null,"","","","","",{"$f":"IF(C224=\"\",\"\",IF(ISNUMBER(SEARCH(\"Start&End\",B224)),SUM(P224:INDEX(P224:P328,MATCH(TRUE,(B224:B328=\"Start&End\"),0))),SUM(P224:INDEX(P224:P328,MATCH(TRUE,(B224:B328=\"End\"),0)))))","v":""},{"$f":"IF(C224=\"\",\"\",IF(ISNUMBER(SEARCH(\"Start&End\",B224)),SUM(Q224:INDEX(Q224:Q328,MATCH(TRUE,(B224:B328=\"Start&End\"),0))),SUM(Q224:INDEX(Q224:Q328,MATCH(TRUE,(B224:B328=\"End\"),0)))))","v":""},"",null,null,null,null,null,null,"","","","","","","","",null,"","","","","","","",null,"","","","","","","",null,"","","","","","","",null,"","","","","","",""]
[223,null,null,null,null,null,null,null,null,null,null,null,"","","","","",{"$f":"IF(C225=\"\",\"\",IF(ISNUMBER(SEARCH(\"Start&End\",B225)),SUM(P225:INDEX(P225:P329,MATCH(TRUE,(B225:B329=\"Start&End\"),0))),SUM(P225:INDEX(P225:P329,MATCH(TRUE,(B225:B329=\"End\"),0)))))","v":""},{"$f":"IF(C225=\"\",\"\",IF(ISNUMBER(SEARCH(\"Start&End\",B225)),SUM(Q225:INDEX(Q225:Q329,MATCH(TRUE,(B225:B329=\"Start&End\"),0))),SUM(Q225:INDEX(Q225:Q329,MATCH(TRUE,(B225:B329=\"End\"),0)))))","v":""},"",null,null,null,null,null,null,"","","","","","","","",null,"","","","","","","",null,"","","","","","","",null,"","","","","","","",null,"","","","","","",""]
[224,null,null,null,null,null,null,null,null,null,null,null,"","","","","",{"$f":"IF(C226=\"\",\"\",IF(ISNUMBER(SEARCH(\"Start&End\",B226)),SUM(P226:INDEX(P226:P330,MATCH(TRUE,(B226:B330=\"Start&End\"),0))),SUM(P226:INDEX(P226:P330,MATCH(TRUE,(B226:B330=\"End\"),0)))))","v":""},{"$f":"IF(C226=\"\",\"\",IF(ISNUMBER(SEARCH(\"Start&End\",B226)),SUM(Q226:INDEX(Q226:Q330,MATCH(TRUE,(B226:B330=\"Start&End\"),0))),SUM(Q226:INDEX(Q226:Q330,MATCH(TRUE,(B226:B330=\"End\"),0)))))","v":""},"",null,null,null,null,null,null,"","","","","","","","",null,"","","","","","","",null,"","","","","","","",null,"","","","","","","",null,"","","","","","",""]
[225,null,null,null,null,null,null,null,null,null,null,null,"","","","","",{"$f":"IF(C227=\"\",\"\",IF(ISNUMBER(SEARCH(\"Start&End\",B227)),SUM(P227:INDEX(P227:P331,MATCH(TRUE,(B227:B331=\"Start&End\"),0))),SUM(P227:INDEX(P227:P331,MATCH(TRUE,(B227:B331=\"End\"),0)))))","v":""},{"$f":"IF(C227=\"\",\"\",IF(ISNUMBER(SEARCH(\"Start&End\",B227)),SUM(Q227:INDEX(Q227:Q331,MATCH(TRUE,(B227:B331=\"Start&End\"),0))),SUM(Q227:INDEX(Q227:Q331,MATCH(TRUE,(B227:B331=\"End\"),0)))))","v":""},"",null,null,null,null,null,null,"","","","","","","","",null,"","","","","","","",null,"","","","","","","",null,"","","","","","","",null,"","","","","","",""]
[226,null,null,null,null,null,null,null,null,null,null,null,"","","","","",{"$f":"IF(C228=\"\",\"\",IF(ISNUMBER(SEARCH(\"Start&End\",B228)),SUM(P228:INDEX(P228:P332,MATCH(TRUE,(B228:B332=\"Start&End\"),0))),SUM(P228:INDEX(P228:P332,MATCH(TRUE,(B228:B332=\"End\"),0)))))","v":""},{"$f":"IF(C228=\"\",\"\",IF(ISNUMBER(SEARCH(\"Start&End\",B228)),SUM(Q228:INDEX(Q228:Q332,MATCH(TRUE,(B228:B332=\"Start&End\"),0))),SUM(Q228:INDEX(Q228:Q332,MATCH(TRUE,(B228:B332=\"End\"),0)))))","v":""},"",null,null,null,null,null,null,"","","","","","","","",null,"","","","","","","",null,"","","","","","","",null,"","","","","","","",null,"","","","","","",""]
[227,null,null,null,null,null,null,null,null,null,null,null,"","","","","",{"$f":"IF(C229=\"\",\"\",IF(ISNUMBER(SEARCH(\"Start&End\",B229)),SUM(P229:INDEX(P229:P333,MATCH(TRUE,(B229:B333=\"Start&End\"),0))),SUM(P229:INDEX(P229:P333,MATCH(TRUE,(B229:B333=\"End\"),0)))))","v":""},{"$f":"IF(C229=\"\",\"\",IF(ISNUMBER(SEARCH(\"Start&End\",B229)),SUM(Q229:INDEX(Q229:Q333,MATCH(TRUE,(B229:B333=\"Start&End\"),0))),SUM(Q229:INDEX(Q229:Q333,MATCH(TRUE,(B229:B333=\"End\"),0)))))","v":""},"",null,null,null,null,null,null,"","","","","","","","",null,"","","","","","","",null,"","","","","","","",null,"","","","","","","",null,"","","","","","",""]
[228,null,null,null,null,null,null,null,null,null,null,null,"","","","","",{"$f":"IF(C230=\"\",\"\",IF(ISNUMBER(SEARCH(\"Start&End\",B230)),SUM(P230:INDEX(P230:P334,MATCH(TRUE,(B230:B334=\"Start&End\"),0))),SUM(P230:INDEX(P230:P334,MATCH(TRUE,(B230:B334=\"End\"),0)))))","v":""},{"$f":"IF(C230=\"\",\"\",IF(ISNUMBER(SEARCH(\"Start&End\",B230)),SUM(Q230:INDEX(Q230:Q334,MATCH(TRUE,(B230:B334=\"Start&End\"),0))),SUM(Q230:INDEX(Q230:Q334,MATCH(TRUE,(B230:B334=\"End\"),0)))))","v":""},"",null,null,null,null,null,null,"","","","","","","","",null,"","","","","","","",null,"","","","","","","",null,"","","","","","","",null,"","","","","","",""]
[229,null,null,null,null,null,null,null,null,null,null,null,"","","","","",{"$f":"IF(C231=\"\",\"\",IF(ISNUMBER(SEARCH(\"Start&End\",B231)),SUM(P231:INDEX(P231:P335,MATCH(TRUE,(B231:B335=\"Start&End\"),0))),SUM(P231:INDEX(P231:P335,MATCH(TRUE,(B231:B335=\"End\"),0)))))","v":""},{"$f":"IF(C231=\"\",\"\",IF(ISNUMBER(SEARCH(\"Start&End\",B231)),SUM(Q231:INDEX(Q231:Q335,MATCH(TRUE,(B231:B335=\"Start&End\"),0))),SUM(Q231:INDEX(Q231:Q335,MATCH(TRUE,(B231:B335=\"End\"),0)))))","v":""},"",null,null,null,null,null,null,"","","","","","","","",null,"","","","","","","",null,"","","","","","","",null,"","","","","","","",null,"","","","","","",""]
[230,null,null,null,null,null,null,null,null,null,null,null,"","","","","",{"$f":"IF(C232=\"\",\"\",IF(ISNUMBER(SEARCH(\"Start&End\",B232)),SUM(P232:INDEX(P232:P336,MATCH(TRUE,(B232:B336=\"Start&End\"),0))),SUM(P232:INDEX(P232:P336,MATCH(TRUE,(B232:B336=\"End\"),0)))))","v":""},{"$f":"IF(C232=\"\",\"\",IF(ISNUMBER(SEARCH(\"Start&End\",B232)),SUM(Q232:INDEX(Q232:Q336,MATCH(TRUE,(B232:B336=\"Start&End\"),0))),SUM(Q232:INDEX(Q232:Q336,MATCH(TRUE,(B232:B336=\"End\"),0)))))","v":""},"",null,null,null,null,null,null,"","","","","","","","",null,"","","","","","","",null,"","","","","","","",null,"","","","","","","",null,"","","","","","",""]
[231,null,null,null,null,null,null,null,null,null,null,null,"","","","","",{"$f":"IF(C233=\"\",\"\",IF(ISNUMBER(SEARCH(\"Start&End\",B233)),SUM(P233:INDEX(P233:P337,MATCH(TRUE,(B233:B337=\"Start&End\"),0))),SUM(P233:INDEX(P233:P337,MATCH(TRUE,(B233:B337=\"End\"),0)))))","v":""},{"$f":"IF(C233=\"\",\"\",IF(ISNUMBER(SEARCH(\"Start&End\",B233)),SUM(Q233:INDEX(Q233:Q337,MATCH(TRUE,(B233:B337=\"Start&End\"),0))),SUM(Q233:INDEX(Q233:Q337,MATCH(TRUE,(B233:B337=\"End\"),0)))))","v":""},"",null,null,null,null,null,null,"","","","","","","","",null,"","","","","","","",null,"","","","","","","",null,"","","","","","","",null,"","","","","","",""]
[232,null,null,null,null,null,null,null,null,null,null,null,"","","","","",{"$f":"IF(C234=\"\",\"\",IF(ISNUMBER(SEARCH(\"Start&End\",B234)),SUM(P234:INDEX(P234:P338,MATCH(TRUE,(B234:B338=\"Start&End\"),0))),SUM(P234:INDEX(P234:P338,MATCH(TRUE,(B234:B338=\"End\"),0)))))","v":""},{"$f":"IF(C234=\"\",\"\",IF(ISNUMBER(SEARCH(\"Start&End\",B234)),SUM(Q234:INDEX(Q234:Q338,MATCH(TRUE,(B234:B338=\"Start&End\"),0))),SUM(Q234:INDEX(Q234:Q338,MATCH(TRUE,(B234:B338=\"End\"),0)))))","v":""},"",null,null,null,null,null,null,"","","","","","","","",null,"","","","","","","",null,"","","","","","","",null,"","","","","","","",null,"","","","","","",""]
[233,null,null,null,null,null,null,null,null,null,null,null,"","","","","",{"$f":"IF(C235=\"\",\"\",IF(ISNUMBER(SEARCH(\"Start&End\",B235)),SUM(P235:INDEX(P235:P339,MATCH(TRUE,(B235:B339=\"Start&End\"),0))),SUM(P235:INDEX(P235:P339,MATCH(TRUE,(B235:B339=\"End\"),0)))))","v":""},{"$f":"IF(C235=\"\",\"\",IF(ISNUMBER(SEARCH(\"Start&End\",B235)),SUM(Q235:INDEX(Q235:Q339,MATCH(TRUE,(B235:B339=\"Start&End\"),0))),SUM(Q235:INDEX(Q235:Q339,MATCH(TRUE,(B235:B339=\"End\"),0)))))","v":""},"",null,null,null,null,null,null,"","","","","","","","",null,"","","","","","","",null,"","","","","","","",null,"","","","","","","",null,"","","","","","",""]
[234,null,null,null,null,null,null,null,null,null,null,null,"","","","","",{"$f":"IF(C236=\"\",\"\",IF(ISNUMBER(SEARCH(\"Start&End\",B236)),SUM(P236:INDEX(P236:P340,MATCH(TRUE,(B236:B340=\"Start&End\"),0))),SUM(P236:INDEX(P236:P340,MATCH(TRUE,(B236:B340=\"End\"),0)))))","v":""},{"$f":"IF(C236=\"\",\"\",IF(ISNUMBER(SEARCH(\"Start&End\",B236)),SUM(Q236:INDEX(Q236:Q340,MATCH(TRUE,(B236:B340=\"Start&End\"),0))),SUM(Q236:INDEX(Q236:Q340,MATCH(TRUE,(B236:B340=\"End\"),0)))))","v":""},"",null,null,null,null,null,null,"","","","","","","","",null,"","","","","","","",null,"","","","","","","",null,"","","","","","","",null,"","","","","","",""]
[235,null,null,null,null,null,null,null,null,null,null,null,"","","","","",{"$f":"IF(C237=\"\",\"\",IF(ISNUMBER(SEARCH(\"Start&End\",B237)),SUM(P237:INDEX(P237:P341,MATCH(TRUE,(B237:B341=\"Start&End\"),0))),SUM(P237:INDEX(P237:P341,MATCH(TRUE,(B237:B341=\"End\"),0)))))","v":""},{"$f":"IF(C237=\"\",\"\",IF(ISNUMBER(SEARCH(\"Start&End\",B237)),SUM(Q237:INDEX(Q237:Q341,MATCH(TRUE,(B237:B341=\"Start&End\"),0))),SUM(Q237:INDEX(Q237:Q341,MATCH(TRUE,(B237:B341=\"End\"),0)))))","v":""},"",null,null,null,null,null,null,"","","","","","","","",null,"","","","","","","",null,"","","","","","","",null,"","","","","","","",null,"","","","","","",""]
[236,null,null,null,null,null,null,null,null,null,null,null,"","","","","",{"$f":"IF(C238=\"\",\"\",IF(ISNUMBER(SEARCH(\"Start&End\",B238)),SUM(P238:INDEX(P238:P342,MATCH(TRUE,(B238:B342=\"Start&End\"),0))),SUM(P238:INDEX(P238:P342,MATCH(TRUE,(B238:B342=\"End\"),0)))))","v":""},{"$f":"IF(C238=\"\",\"\",IF(ISNUMBER(SEARCH(\"Start&End\",B238)),SUM(Q238:INDEX(Q238:Q342,MATCH(TRUE,(B238:B342=\"Start&End\"),0))),SUM(Q238:INDEX(Q238:Q342,MATCH(TRUE,(B238:B342=\"End\"),0)))))","v":""},"",null,null,null,null,null,null,"","","","","","","","",null,"","","","","","","",null,"","","","","","","",null,"","","","","","","",null,"","","","","","",""]
[237,null,null,null,null,null,null,null,null,null,null,null,"","","","","",{"$f":"IF(C239=\"\",\"\",IF(ISNUMBER(SEARCH(\"Start&End\",B239)),SUM(P239:INDEX(P239:P343,MATCH(TRUE,(B239:B343=\"Start&End\"),0))),SUM(P239:INDEX(P239:P343,MATCH(TRUE,(B239:B343=\"End\"),0)))))","v":""},{"$f":"IF(C239=\"\",\"\",IF(ISNUMBER(SEARCH(\"Start&End\",B239)),SUM(Q239:INDEX(Q239:Q343,MATCH(TRUE,(B239:B343=\"Start&End\"),0))),SUM(Q239:INDEX(Q239:Q343,MATCH(TRUE,(B239:B343=\"End\"),0)))))","v":""},"",null,null,null,null,null,null,"","","","","","","","",null,"","","","","","","",null,"","","","","","","",null,"","","","","","","",null,"","","","","","",""]
[238,null,null,null,null,null,null,null,null,null,null,null,"","","","","",{"$f":"IF(C240=\"\",\"\",IF(ISNUMBER(SEARCH(\"Start&End\",B240)),SUM(P240:INDEX(P240:P344,MATCH(TRUE,(B240:B344=\"Start&End\"),0))),SUM(P240:INDEX(P240:P344,MATCH(TRUE,(B240:B344=\"End\"),0)))))","v":""},{"$f":"IF(C240=\"\",\"\",IF(ISNUMBER(SEARCH(\"Start&End\",B240)),SUM(Q240:INDEX(Q240:Q344,MATCH(TRUE,(B240:B344=\"Start&End\"),0))),SUM(Q240:INDEX(Q240:Q344,MATCH(TRUE,(B240:B344=\"End\"),0)))))","v":""},"",null,null,null,null,null,null,"","","","","","","","",null,"","","","","","","",null,"","","","","","","",null,"","","","","","","",null,"","","","","","",""]
[239,null,null,null,null,null,null,null,null,null,null,null,"","","","","",{"$f":"IF(C241=\"\",\"\",IF(ISNUMBER(SEARCH(\"Start&End\",B241)),SUM(P241:INDEX(P241:P345,MATCH(TRUE,(B241:B345=\"Start&End\"),0))),SUM(P241:INDEX(P241:P345,MATCH(TRUE,(B241:B345=\"End\"),0)))))","v":""},{"$f":"IF(C241=\"\",\"\",IF(ISNUMBER(SEARCH(\"Start&End\",B241)),SUM(Q241:INDEX(Q241:Q345,MATCH(TRUE,(B241:B345=\"Start&End\"),0))),SUM(Q241:INDEX(Q241:Q345,MATCH(TRUE,(B241:B345=\"End\"),0)))))","v":""},"",null,null,null,null,null,null,"","","","","","","","",null,"","","","","","","",null,"","","","","","","",null,"","","","","","","",null,"","","","","","",""]
[240,null,null,null,null,null,null,null,null,null,null,null,"","","","","",{"$f":"IF(C242=\"\",\"\",IF(ISNUMBER(SEARCH(\"Start&End\",B242)),SUM(P242:INDEX(P242:P346,MATCH(TRUE,(B242:B346=\"Start&End\"),0))),SUM(P242:INDEX(P242:P346,MATCH(TRUE,(B242:B346=\"End\"),0)))))","v":""},{"$f":"IF(C242=\"\",\"\",IF(ISNUMBER(SEARCH(\"Start&End\",B242)),SUM(Q242:INDEX(Q242:Q346,MATCH(TRUE,(B242:B346=\"Start&End\"),0))),SUM(Q242:INDEX(Q242:Q346,MATCH(TRUE,(B242:B346=\"End\"),0)))))","v":""},"",null,null,null,null,null,null,"","","","","","","","",null,"","","","","","","",null,"","","","","","","",null,"","","","","","","",null,"","","","","","",""]
[241,null,null,null,null,null,null,null,null,null,null,null,"","","","","",{"$f":"IF(C243=\"\",\"\",IF(ISNUMBER(SEARCH(\"Start&End\",B243)),SUM(P243:INDEX(P243:P347,MATCH(TRUE,(B243:B347=\"Start&End\"),0))),SUM(P243:INDEX(P243:P347,MATCH(TRUE,(B243:B347=\"End\"),0)))))","v":""},{"$f":"IF(C243=\"\",\"\",IF(ISNUMBER(SEARCH(\"Start&End\",B243)),SUM(Q243:INDEX(Q243:Q347,MATCH(TRUE,(B243:B347=\"Start&End\"),0))),SUM(Q243:INDEX(Q243:Q347,MATCH(TRUE,(B243:B347=\"End\"),0)))))","v":""},"",null,null,null,null,null,null,"","","","","","","","",null,"","","","","","","",null,"","","","","","","",null,"","","","","","","",null,"","","","","","",""]
[242,null,null,null,null,null,null,null,null,null,null,null,"","","","","",{"$f":"IF(C244=\"\",\"\",IF(ISNUMBER(SEARCH(\"Start&End\",B244)),SUM(P244:INDEX(P244:P348,MATCH(TRUE,(B244:B348=\"Start&End\"),0))),SUM(P244:INDEX(P244:P348,MATCH(TRUE,(B244:B348=\"End\"),0)))))","v":""},{"$f":"IF(C244=\"\",\"\",IF(ISNUMBER(SEARCH(\"Start&End\",B244)),SUM(Q244:INDEX(Q244:Q348,MATCH(TRUE,(B244:B348=\"Start&End\"),0))),SUM(Q244:INDEX(Q244:Q348,MATCH(TRUE,(B244:B348=\"End\"),0)))))","v":""},"",null,null,null,null,null,null,"","","","","","","","",null,"","","","","","","",null,"","","","","","","",null,"","","","","","","",null,"","","","","","",""]
[243,null,null,null,null,null,null,null,null,null,null,null,"","","","","",{"$f":"IF(C245=\"\",\"\",IF(ISNUMBER(SEARCH(\"Start&End\",B245)),SUM(P245:INDEX(P245:P349,MATCH(TRUE,(B245:B349=\"Start&End\"),0))),SUM(P245:INDEX(P245:P349,MATCH(TRUE,(B245:B349=\"End\"),0)))))","v":""},{"$f":"IF(C245=\"\",\"\",IF(ISNUMBER(SEARCH(\"Start&End\",B245)),SUM(Q245:INDEX(Q245:Q349,MATCH(TRUE,(B245:B349=\"Start&End\"),0))),SUM(Q245:INDEX(Q245:Q349,MATCH(TRUE,(B245:B349=\"End\"),0)))))","v":""},"",null,null,null,null,null,null,"","","","","","","","",null,"","","","","","","",null,"","","","","","","",null,"","","","","","","",null,"","","","","","",""]
[244,null,null,null,null,null,null,null,null,null,null,null,"","","","","",{"$f":"IF(C246=\"\",\"\",IF(ISNUMBER(SEARCH(\"Start&End\",B246)),SUM(P246:INDEX(P246:P350,MATCH(TRUE,(B246:B350=\"Start&End\"),0))),SUM(P246:INDEX(P246:P350,MATCH(TRUE,(B246:B350=\"End\"),0)))))","v":""},{"$f":"IF(C246=\"\",\"\",IF(ISNUMBER(SEARCH(\"Start&End\",B246)),SUM(Q246:INDEX(Q246:Q350,MATCH(TRUE,(B246:B350=\"Start&End\"),0))),SUM(Q246:INDEX(Q246:Q350,MATCH(TRUE,(B246:B350=\"End\"),0)))))","v":""},"",null,null,null,null,null,null,"","","","","","","","",null,"","","","","","","",null,"","","","","","","",null,"","","","","","","",null,"","","","","","",""]
[245,null,null,null,null,null,null,null,null,null,null,null,"","","","","",{"$f":"IF(C247=\"\",\"\",IF(ISNUMBER(SEARCH(\"Start&End\",B247)),SUM(P247:INDEX(P247:P351,MATCH(TRUE,(B247:B351=\"Start&End\"),0))),SUM(P247:INDEX(P247:P351,MATCH(TRUE,(B247:B351=\"End\"),0)))))","v":""},{"$f":"IF(C247=\"\",\"\",IF(ISNUMBER(SEARCH(\"Start&End\",B247)),SUM(Q247:INDEX(Q247:Q351,MATCH(TRUE,(B247:B351=\"Start&End\"),0))),SUM(Q247:INDEX(Q247:Q351,MATCH(TRUE,(B247:B351=\"End\"),0)))))","v":""},"",null,null,null,null,null,null,"","","","","","","","",null,"","","","","","","",null,"","","","","","","",null,"","","","","","","",null,"","","","","","",""]
[246,null,null,null,null,null,null,null,null,null,null,null,"","","","","",{"$f":"IF(C248=\"\",\"\",IF(ISNUMBER(SEARCH(\"Start&End\",B248)),SUM(P248:INDEX(P248:P352,MATCH(TRUE,(B248:B352=\"Start&End\"),0))),SUM(P248:INDEX(P248:P352,MATCH(TRUE,(B248:B352=\"End\"),0)))))","v":""},{"$f":"IF(C248=\"\",\"\",IF(ISNUMBER(SEARCH(\"Start&End\",B248)),SUM(Q248:INDEX(Q248:Q352,MATCH(TRUE,(B248:B352=\"Start&End\"),0))),SUM(Q248:INDEX(Q248:Q352,MATCH(TRUE,(B248:B352=\"End\"),0)))))","v":""},"",null,null,null,null,null,null,"","","","","","","","",null,"","","","","","","",null,"","","","","","","",null,"","","","","","","",null,"","","","","","",""]
[247,null,null,null,null,null,null,null,null,null,null,null,"","","","","",{"$f":"IF(C249=\"\",\"\",IF(ISNUMBER(SEARCH(\"Start&End\",B249)),SUM(P249:INDEX(P249:P353,MATCH(TRUE,(B249:B353=\"Start&End\"),0))),SUM(P249:INDEX(P249:P353,MATCH(TRUE,(B249:B353=\"End\"),0)))))","v":""},{"$f":"IF(C249=\"\",\"\",IF(ISNUMBER(SEARCH(\"Start&End\",B249)),SUM(Q249:INDEX(Q249:Q353,MATCH(TRUE,(B249:B353=\"Start&End\"),0))),SUM(Q249:INDEX(Q249:Q353,MATCH(TRUE,(B249:B353=\"End\"),0)))))","v":""},"",null,null,null,null,null,null,"","","","","","","","",null,"","","","","","","",null,"","","","","","","",null,"","","","","","","",null,"","","","","","",""]
[248,null,null,null,null,null,null,null,null,null,null,null,"","","","","",{"$f":"IF(C250=\"\",\"\",IF(ISNUMBER(SEARCH(\"Start&End\",B250)),SUM(P250:INDEX(P250:P354,MATCH(TRUE,(B250:B354=\"Start&End\"),0))),SUM(P250:INDEX(P250:P354,MATCH(TRUE,(B250:B354=\"End\"),0)))))","v":""},{"$f":"IF(C250=\"\",\"\",IF(ISNUMBER(SEARCH(\"Start&End\",B250)),SUM(Q250:INDEX(Q250:Q354,MATCH(TRUE,(B250:B354=\"Start&End\"),0))),SUM(Q250:INDEX(Q250:Q354,MATCH(TRUE,(B250:B354=\"End\"),0)))))","v":""},"",null,null,null,null,null,null,"","","","","","","","",null,"","","","","","","",null,"","","","","","","",null,"","","","","","","",null,"","","","","","",""]
[249,null,null,null,null,null,null,null,null,null,null,null,"","","","","",{"$f":"IF(C251=\"\",\"\",IF(ISNUMBER(SEARCH(\"Start&End\",B251)),SUM(P251:INDEX(P251:P355,MATCH(TRUE,(B251:B355=\"Start&End\"),0))),SUM(P251:INDEX(P251:P355,MATCH(TRUE,(B251:B355=\"End\"),0)))))","v":""},{"$f":"IF(C251=\"\",\"\",IF(ISNUMBER(SEARCH(\"Start&End\",B251)),SUM(Q251:INDEX(Q251:Q355,MATCH(TRUE,(B251:B355=\"Start&End\"),0))),SUM(Q251:INDEX(Q251:Q355,MATCH(TRUE,(B251:B355=\"End\"),0)))))","v":""},"",null,null,null,null,null,null,"","","","","","","","",null,"","","","","","","",null,"","","","","","","",null,"","","","","","","",null,"","","","","","",""]
[250,null,null,null,null,null,null,null,null,null,null,null,"","","","","",{"$f":"IF(C252=\"\",\"\",IF(ISNUMBER(SEARCH(\"Start&End\",B252)),SUM(P252:INDEX(P252:P356,MATCH(TRUE,(B252:B356=\"Start&End\"),0))),SUM(P252:INDEX(P252:P356,MATCH(TRUE,(B252:B356=\"End\"),0)))))","v":""},{"$f":"IF(C252=\"\",\"\",IF(ISNUMBER(SEARCH(\"Start&End\",B252)),SUM(Q252:INDEX(Q252:Q356,MATCH(TRUE,(B252:B356=\"Start&End\"),0))),SUM(Q252:INDEX(Q252:Q356,MATCH(TRUE,(B252:B356=\"End\"),0)))))","v":""},"",null,null,null,null,null,null,"","","","","","","","",null,"","","","","","","",null,"","","","","","","",null,"","","","","","","",null,"","","","","","",""]
[251,null,null,null,null,null,null,null,null,null,null,null,"","","","","",{"$f":"IF(C253=\"\",\"\",IF(ISNUMBER(SEARCH(\"Start&End\",B253)),SUM(P253:INDEX(P253:P357,MATCH(TRUE,(B253:B357=\"Start&End\"),0))),SUM(P253:INDEX(P253:P357,MATCH(TRUE,(B253:B357=\"End\"),0)))))","v":""},{"$f":"IF(C253=\"\",\"\",IF(ISNUMBER(SEARCH(\"Start&End\",B253)),SUM(Q253:INDEX(Q253:Q357,MATCH(TRUE,(B253:B357=\"Start&End\"),0))),SUM(Q253:INDEX(Q253:Q357,MATCH(TRUE,(B253:B357=\"End\"),0)))))","v":""},"",null,null,null,null,null,null,"","","","","","","","",null,"","","","","","","",null,"","","","","","","",null,"","","","","","","",null,"","","","","","",""]
[252,null,null,null,null,null,null,null,null,null,null,null,"","","","","",{"$f":"IF(C254=\"\",\"\",IF(ISNUMBER(SEARCH(\"Start&End\",B254)),SUM(P254:INDEX(P254:P358,MATCH(TRUE,(B254:B358=\"Start&End\"),0))),SUM(P254:INDEX(P254:P358,MATCH(TRUE,(B254:B358=\"End\"),0)))))","v":""},{"$f":"IF(C254=\"\",\"\",IF(ISNUMBER(SEARCH(\"Start&End\",B254)),SUM(Q254:INDEX(Q254:Q358,MATCH(TRUE,(B254:B358=\"Start&End\"),0))),SUM(Q254:INDEX(Q254:Q358,MATCH(TRUE,(B254:B358=\"End\"),0)))))","v":""},"",null,null,null,null,null,null,"","","","","","","","",null,"","","","","","","",null,"","","","","","","",null,"","","","","","","",null,"","","","","","",""]
[253,null,null,null,null,null,null,null,null,null,null,null,"","","","","",{"$f":"IF(C255=\"\",\"\",IF(ISNUMBER(SEARCH(\"Start&End\",B255)),SUM(P255:INDEX(P255:P359,MATCH(TRUE,(B255:B359=\"Start&End\"),0))),SUM(P255:INDEX(P255:P359,MATCH(TRUE,(B255:B359=\"End\"),0)))))","v":""},{"$f":"IF(C255=\"\",\"\",IF(ISNUMBER(SEARCH(\"Start&End\",B255)),SUM(Q255:INDEX(Q255:Q359,MATCH(TRUE,(B255:B359=\"Start&End\"),0))),SUM(Q255:INDEX(Q255:Q359,MATCH(TRUE,(B255:B359=\"End\"),0)))))","v":""},"",null,null,null,null,null,null,"","","","","","","","",null,"","","","","","","",null,"","","","","","","",null,"","","","","","","",null,"","","","","","",""]
[254,null,null,null,null,null,null,null,null,null,null,null,"","","","","",{"$f":"IF(C256=\"\",\"\",IF(ISNUMBER(SEARCH(\"Start&End\",B256)),SUM(P256:INDEX(P256:P360,MATCH(TRUE,(B256:B360=\"Start&End\"),0))),SUM(P256:INDEX(P256:P360,MATCH(TRUE,(B256:B360=\"End\"),0)))))","v":""},{"$f":"IF(C256=\"\",\"\",IF(ISNUMBER(SEARCH(\"Start&End\",B256)),SUM(Q256:INDEX(Q256:Q360,MATCH(TRUE,(B256:B360=\"Start&End\"),0))),SUM(Q256:INDEX(Q256:Q360,MATCH(TRUE,(B256:B360=\"End\"),0)))))","v":""},"",null,null,null,null,null,null,"","","","","","","","",null,"","","","","","","",null,"","","","","","","",null,"","","","","","","",null,"","","","","","",""]
[255,null,null,null,null,null,null,null,null,null,null,null,"","","","","",{"$f":"IF(C257=\"\",\"\",IF(ISNUMBER(SEARCH(\"Start&End\",B257)),SUM(P257:INDEX(P257:P361,MATCH(TRUE,(B257:B361=\"Start&End\"),0))),SUM(P257:INDEX(P257:P361,MATCH(TRUE,(B257:B361=\"End\"),0)))))","v":""},{"$f":"IF(C257=\"\",\"\",IF(ISNUMBER(SEARCH(\"Start&End\",B257)),SUM(Q257:INDEX(Q257:Q361,MATCH(TRUE,(B257:B361=\"Start&End\"),0))),SUM(Q257:INDEX(Q257:Q361,MATCH(TRUE,(B257:B361=\"End\"),0)))))","v":""},"",null,null,null,null,null,null,"","","","","","","","",null,"","","","","","","",null,"","","","","","","",null,"","","","","","","",null,"","","","","","",""]
[256,null,null,null,null,null,null,null,null,null,null,null,"","","","","",{"$f":"IF(C258=\"\",\"\",IF(ISNUMBER(SEARCH(\"Start&End\",B258)),SUM(P258:INDEX(P258:P362,MATCH(TRUE,(B258:B362=\"Start&End\"),0))),SUM(P258:INDEX(P258:P362,MATCH(TRUE,(B258:B362=\"End\"),0)))))","v":""},{"$f":"IF(C258=\"\",\"\",IF(ISNUMBER(SEARCH(\"Start&End\",B258)),SUM(Q258:INDEX(Q258:Q362,MATCH(TRUE,(B258:B362=\"Start&End\"),0))),SUM(Q258:INDEX(Q258:Q362,MATCH(TRUE,(B258:B362=\"End\"),0)))))","v":""},"",null,null,null,null,null,null,"","","","","","","","",null,"","","","","","","",null,"","","","","","","",null,"","","","","","","",null,"","","","","","",""]
[257,null,null,null,null,null,null,null,null,null,null,null,"","","","",{"$f":"IF(AA259=\"\",\"\",O259-P259)","v":""},{"$f":"IF(C259=\"\",\"\",IF(ISNUMBER(SEARCH(\"Start&End\",B259)),SUM(P259:INDEX(P259:P363,MATCH(TRUE,(B259:B363=\"Start&End\"),0))),SUM(P259:INDEX(P259:P363,MATCH(TRUE,(B259:B363=\"End\"),0)))))","v":""},{"$f":"IF(C259=\"\",\"\",IF(ISNUMBER(SEARCH(\"Start&End\",B259)),SUM(Q259:INDEX(Q259:Q363,MATCH(TRUE,(B259:B363=\"Start&End\"),0))),SUM(Q259:INDEX(Q259:Q363,MATCH(TRUE,(B259:B363=\"End\"),0)))))","v":""},{"$f":"IF(ISNUMBER(S259),S259,\"\")","v":""},null,null,null,null,null,null,{"$f":"IF((H259+I259)*G259=0,\"\",(H259+I259)*G259)","v":""},{"$f":"IF(ISNUMBER(SEARCH(\"FUT\",E259)),AZ259,IF(ISNUMBER(SEARCH(\"OPT\",E259)),BH259,IF(ISNUMBER(SEARCH(\"HOLD\",E259)),AJ259,AR259)))","v":""},{"$f":"IF(ISNUMBER(SEARCH(\"HOLD\",E259)),AK259,IF(ISNUMBER(SEARCH(\"INTRA\",E259)),AS259,IF(ISNUMBER(SEARCH(\"FUT\",E259)),BA259,BI259)))","v":""},{"$f":"IF(ISNUMBER(SEARCH(\"HOLD\",E259)),AL259,IF(ISNUMBER(SEARCH(\"INTRA\",E259)),AT259,IF(ISNUMBER(SEARCH(\"FUT\",E259)),BB259,BJ259)))","v":""},{"$f":"IF(ISNUMBER(SEARCH(\"HOLD\",E259)),AM259,IF(ISNUMBER(SEARCH(\"INTRA\",E259)),AU259,IF(ISNUMBER(SEARCH(\"FUT\",E259)),BC259,BK259)))","v":""},{"$f":"IF(ISNUMBER(SEARCH(\"HOLD\",E259)),AN259,IF(ISNUMBER(SEARCH(\"INTRA\",E259)),AV259,IF(ISNUMBER(SEARCH(\"FUT\",E259)),BD259,BL259)))","v":""},{"$f":"IF(ISNUMBER(SEARCH(\"HOLD\",E259)),AO259,IF(ISNUMBER(SEARCH(\"INTRA\",E259)),AW259,IF(ISNUMBER(SEARCH(\"FUT\",E259)),BE259,BM259)))","v":""},"",null,"","","","","",{"$f":"IF(G259&H259=\"\",\"\",ROUND(G259*H259*0.00015,2))","v":""},"",null,{"$f":"IF(MIN(20,((G259*H259*0.0003)))+MIN(20,((G259*H259*0.0003)))=0,\"\",MIN(20,((G259*H259*0.0003)))+MIN(20,((G259*H259*0.0003))))","v":""},{"$f":"IF(I259&G259=\"\",\"\",ROUND(I259*G259*0.00025,0))","v":""},"","","",{"$f":"IF(G259&H259=\"\",\"\",ROUND(G259*H259*0.00003,2))","v":""},"",null,{"$f":"IF(MIN(20,((G259*H259*0.0003)))+MIN(20,((G259*H259*0.0003)))=0,\"\",MIN(20,((G259*H259*0.0003)))+MIN(20,((G259*H259*0.0003))))","v":""},{"$f":"IF(I259&G259=\"\",\"\",ROUND(I259*G259*0.0001,0))","v":""},"","","",{"$f":"IF(G259&H259=\"\",\"\",ROUND(G259*H259*0.00002,2))","v":""},"",null,{"$f":"IF(AA259=\"\",\"\",40)","v":""},{"$f":"IF(I259&G259=\"\",\"\",ROUND(I259*G259*0.0005,0))","v":""},{"$f":"IF(AA259=\"\",\"\",ROUND(AA259*0.00053,2))","v":""},"",{"$f":"IF(AA259=\"\",\"\",ROUND((5/10000000)*AA259,2))","v":""},{"$f":"IF(G259&H259=\"\",\"\",ROUND(G259*H259*0.00003,2))","v":""},""]
[258,null,null,null,null,null,null,null,null,null,null,null,{"$f":"IF(OR(J260=\"\",K260=\"\"),\"\",IF(F260=\"Long\",  ((K260-H260)/(H260-J260)), ((I260-K260)/(J260-I260)) ))","v":""},{"$f":"IF(OR(I260=\"\",D260=\"\",H260=\"\",G260=\"\",E260=\"\",K260=\"\"),\"\",IF(I260=K260,\"Target Achieved\",IF(I260=J260,\"SL Hit\",IF(I260<J260,\"Extended SL Hit\",IF(I260>K260,\"Target Overachieved\",IF(AND(I260>=H260,I260<K260),\"Early Profit Exit\",\"Early Loss Exit\"))))))","v":""},{"$f":"IF(AA260=\"\",\"\",IF(OR(I260=\"\",H260=\"\"),0,G260*(I260-H260)))","v":""},{"$f":"IF(AH260=\"\",\"\",AH260)","v":""},"",{"$f":"IF(C260=\"\",\"\",IF(ISNUMBER(SEARCH(\"Start&End\",B260)),SUM(P260:INDEX(P260:P364,MATCH(TRUE,(B260:B364=\"Start&End\"),0))),SUM(P260:INDEX(P260:P364,MATCH(TRUE,(B260:B364=\"End\"),0)))))","v":""},{"$f":"IF(C260=\"\",\"\",IF(ISNUMBER(SEARCH(\"Start&End\",B260)),SUM(Q260:INDEX(Q260:Q364,MATCH(TRUE,(B260:B364=\"Start&End\"),0))),SUM(Q260:INDEX(Q260:Q364,MATCH(TRUE,(B260:B364=\"End\"),0)))))","v":""},"",null,null,null,null,null,null,"","","","","","","",{"$f":"IF(AB260&AC260&AD260&AE260&AF260&AG260=\"\",\"\",SUM(AB260:AG260))","v":""},null,{"$f":"IF(AA260=\"\",\"\",0)","v":""},{"$f":"IF(AA260=\"\",\"\",ROUND(AA260*0.001,2))","v":""},{"$f":"IF(AA260=\"\",\"\",ROUND(AA260*0.0000345,2))","v":""},{"$f":"IF(AJ260&AL260=\"\",\"\",ROUND((AJ260+AL260)*0.18,2))","v":""},{"$f":"IF(AA260=\"\",\"\",ROUND((5/10000000)*AA260,2))","v":""},"",{"$f":"IF(AK260&AL260&AM260&AN260&AO260=\"\",\"\",SUM(AK260:AO260))","v":""},null,"","",{"$f":"IF(AA260=\"\",\"\",ROUND(AA260*0.0000345,2))","v":""},{"$f":"IF(AR260&AT260=\"\",\"\",ROUND((AR260+AT260)*0.18,2))","v":""},{"$f":"IF(AA260=\"\",\"\",ROUND((5/10000000)*AA260,2))","v":""},"",{"$f":"IF(AR260&AS260&AT260&AU260&AV260&AW260=\"\",\"\",SUM(AR260:AW260))","v":""},null,"","",{"$f":"IF(AA260=\"\",\"\",ROUND(AA260*0.00002,2))","v":""},{"$f":"IF(AZ260&BB260=\"\",\"\",ROUND((AZ260+BB260)*0.18,2))","v":""},{"$f":"IF(AA260=\"\",\"\",ROUND((5/10000000)*AA260,2))","v":""},"","",null,"","","",{"$f":"IF(BH260&BJ260=\"\",\"\",ROUND((BH260+BJ260)*0.18,2))","v":""},"","",{"$f":"IF(BH260&BI260&BJ260&BK260&BL260&BM260=\"\",\"\",SUM(BH260:BM260))","v":""}]
[259,null,null,null,null,null,null,null,null,null,null,null,"","","","","",{"$f":"IF(C261=\"\",\"\",IF(ISNUMBER(SEARCH(\"Start&End\",B261)),SUM(P261:INDEX(P261:P365,MATCH(TRUE,(B261:B365=\"Start&End\"),0))),SUM(P261:INDEX(P261:P365,MATCH(TRUE,(B261:B365=\"End\"),0)))))","v":""},{"$f":"IF(C261=\"\",\"\",IF(ISNUMBER(SEARCH(\"Start&End\",B261)),SUM(Q261:INDEX(Q261:Q365,MATCH(TRUE,(B261:B365=\"Start&End\"),0))),SUM(Q261:INDEX(Q261:Q365,MATCH(TRUE,(B261:B365=\"End\"),0)))))","v":""},"",null,null,null,null,null,null,"","","","","","","","",null,"","","","","","","",null,"","","","","","","",null,"","","","","","",{"$f":"IF(FAX261&BA261&BB261&BC261&BD261&BE261=\"\",\"\",SUM(AZ261:BE261))","v":""},null,"","","","","","",""]
[260,null,null,null,null,null,null,null,null,null,null,null,"","","","","",{"$f":"IF(C262=\"\",\"\",IF(ISNUMBER(SEARCH(\"Start&End\",B262)),SUM(P262:INDEX(P262:P366,MATCH(TRUE,(B262:B366=\"Start&End\"),0))),SUM(P262:INDEX(P262:P366,MATCH(TRUE,(B262:B366=\"End\"),0)))))","v":""},{"$f":"IF(C262=\"\",\"\",IF(ISNUMBER(SEARCH(\"Start&End\",B262)),SUM(Q262:INDEX(Q262:Q366,MATCH(TRUE,(B262:B366=\"Start&End\"),0))),SUM(Q262:INDEX(Q262:Q366,MATCH(TRUE,(B262:B366=\"End\"),0)))))","v":""},"",null,null,null,null,null,null,"","","","","","","","",null,"","","","","","","",null,"","","","","","","",null,"","","","","","","",null,"","","","","","",""]
[261,null,null,null,null,null,null,null,null,null,null,null,"","","","","",{"$f":"IF(C263=\"\",\"\",IF(ISNUMBER(SEARCH(\"Start&End\",B263)),SUM(P263:INDEX(P263:P367,MATCH(TRUE,(B263:B367=\"Start&End\"),0))),SUM(P263:INDEX(P263:P367,MATCH(TRUE,(B263:B367=\"End\"),0)))))","v":""},{"$f":"IF(C263=\"\",\"\",IF(ISNUMBER(SEARCH(\"Start&End\",B263)),SUM(Q263:INDEX(Q263:Q367,MATCH(TRUE,(B263:B367=\"Start&End\"),0))),SUM(Q263:INDEX(Q263:Q367,MATCH(TRUE,(B263:B367=\"End\"),0)))))","v":""},"",null,null,null,null,null,null,"","","","","","","","",null,"","","","","","","",null,"","","","","","","",null,"","","","","","","",null,"","","","","","",""]
[262,null,null,null,null,null,null,null,null,null,null,null,"","","","","",{"$f":"IF(C264=\"\",\"\",IF(ISNUMBER(SEARCH(\"Start&End\",B264)),SUM(P264:INDEX(P264:P368,MATCH(TRUE,(B264:B368=\"Start&End\"),0))),SUM(P264:INDEX(P264:P368,MATCH(TRUE,(B264:B368=\"End\"),0)))))","v":""},{"$f":"IF(C264=\"\",\"\",IF(ISNUMBER(SEARCH(\"Start&End\",B264)),SUM(Q264:INDEX(Q264:Q368,MATCH(TRUE,(B264:B368=\"Start&End\"),0))),SUM(Q264:INDEX(Q264:Q368,MATCH(TRUE,(B264:B368=\"End\"),0)))))","v":""},"",null,null,null,null,null,null,"","","","","","","","",null,"","","","","","","",null,"","","","","","","",null,"","","","","","","",null,"","","","","","",""]
[263,null,null,null,null,null,null,null,null,null,null,null,"","","","","",{"$f":"IF(C265=\"\",\"\",IF(ISNUMBER(SEARCH(\"Start&End\",B265)),SUM(P265:INDEX(P265:P369,MATCH(TRUE,(B265:B369=\"Start&End\"),0))),SUM(P265:INDEX(P265:P369,MATCH(TRUE,(B265:B369=\"End\"),0)))))","v":""},{"$f":"IF(C265=\"\",\"\",IF(ISNUMBER(SEARCH(\"Start&End\",B265)),SUM(Q265:INDEX(Q265:Q369,MATCH(TRUE,(B265:B369=\"Start&End\"),0))),SUM(Q265:INDEX(Q265:Q369,MATCH(TRUE,(B265:B369=\"End\"),0)))))","v":""},"",null,null,null,null,null,null,"","","","","","","","",null,"","","","","","","",null,"","","","","","","",null,"","","","","","","",null,"","","","","","",""]
[264,null,null,null,null,null,null,null,null,null,null,null,"","","","","",{"$f":"IF(C266=\"\",\"\",IF(ISNUMBER(SEARCH(\"Start&End\",B266)),SUM(P266:INDEX(P266:P370,MATCH(TRUE,(B266:B370=\"Start&End\"),0))),SUM(P266:INDEX(P266:P370,MATCH(TRUE,(B266:B370=\"End\"),0)))))","v":""},{"$f":"IF(C266=\"\",\"\",IF(ISNUMBER(SEARCH(\"Start&End\",B266)),SUM(Q266:INDEX(Q266:Q370,MATCH(TRUE,(B266:B370=\"Start&End\"),0))),SUM(Q266:INDEX(Q266:Q370,MATCH(TRUE,(B266:B370=\"End\"),0)))))","v":""},"",null,null,null,null,null,null,"","","","","","","","",null,"","","","","","","",null,"","","","","","","",null,"","","","","","","",null,"","","","","","",""]
[265,null,null,null,null,null,null,null,null,null,null,null,"","","","","",{"$f":"IF(C267=\"\",\"\",IF(ISNUMBER(SEARCH(\"Start&End\",B267)),SUM(P267:INDEX(P267:P371,MATCH(TRUE,(B267:B371=\"Start&End\"),0))),SUM(P267:INDEX(P267:P371,MATCH(TRUE,(B267:B371=\"End\"),0)))))","v":""},{"$f":"IF(C267=\"\",\"\",IF(ISNUMBER(SEARCH(\"Start&End\",B267)),SUM(Q267:INDEX(Q267:Q371,MATCH(TRUE,(B267:B371=\"Start&End\"),0))),SUM(Q267:INDEX(Q267:Q371,MATCH(TRUE,(B267:B371=\"End\"),0)))))","v":""},"",null,null,null,null,null,null,"","","","","","","","",null,"","","","","","","",null,"","","","","","","",null,"","","","","","","",null,"","","","","","",""]
[266,null,null,null,null,null,null,null,null,null,null,null,"","","","","",{"$f":"IF(C268=\"\",\"\",IF(ISNUMBER(SEARCH(\"Start&End\",B268)),SUM(P268:INDEX(P268:P372,MATCH(TRUE,(B268:B372=\"Start&End\"),0))),SUM(P268:INDEX(P268:P372,MATCH(TRUE,(B268:B372=\"End\"),0)))))","v":""},{"$f":"IF(C268=\"\",\"\",IF(ISNUMBER(SEARCH(\"Start&End\",B268)),SUM(Q268:INDEX(Q268:Q372,MATCH(TRUE,(B268:B372=\"Start&End\"),0))),SUM(Q268:INDEX(Q268:Q372,MATCH(TRUE,(B268:B372=\"End\"),0)))))","v":""},"",null,null,null,null,null,null,"","","","","","","","",null,"","","","","","","",null,"","","","","","","",null,"","","","","","","",null,"","","","","","",""]
[267,null,null,null,null,null,null,null,null,null,null,null,"","","","","",{"$f":"IF(C269=\"\",\"\",IF(ISNUMBER(SEARCH(\"Start&End\",B269)),SUM(P269:INDEX(P269:P373,MATCH(TRUE,(B269:B373=\"Start&End\"),0))),SUM(P269:INDEX(P269:P373,MATCH(TRUE,(B269:B373=\"End\"),0)))))","v":""},{"$f":"IF(C269=\"\",\"\",IF(ISNUMBER(SEARCH(\"Start&End\",B269)),SUM(Q269:INDEX(Q269:Q373,MATCH(TRUE,(B269:B373=\"Start&End\"),0))),SUM(Q269:INDEX(Q269:Q373,MATCH(TRUE,(B269:B373=\"End\"),0)))))","v":""},"",null,null,null,null,null,null,"","","","","","","","",null,"","","","","","","",null,"","","","","","","",null,"","","","","","","",null,"","","","","","",""]
[268,null,null,null,null,null,null,null,null,null,null,null,"","","","","",{"$f":"IF(C270=\"\",\"\",IF(ISNUMBER(SEARCH(\"Start&End\",B270)),SUM(P270:INDEX(P270:P374,MATCH(TRUE,(B270:B374=\"Start&End\"),0))),SUM(P270:INDEX(P270:P374,MATCH(TRUE,(B270:B374=\"End\"),0)))))","v":""},{"$f":"IF(C270=\"\",\"\",IF(ISNUMBER(SEARCH(\"Start&End\",B270)),SUM(Q270:INDEX(Q270:Q374,MATCH(TRUE,(B270:B374=\"Start&End\"),0))),SUM(Q270:INDEX(Q270:Q374,MATCH(TRUE,(B270:B374=\"End\"),0)))))","v":""},"",null,null,null,null,null,null,"","","","","","","","",null,"","","","","","","",null,"","","","","","","",null,"","","","","","","",null,"","","","","","",""]
[269,null,null,null,null,null,null,null,null,null,null,null,"","","","","",{"$f":"IF(C271=\"\",\"\",IF(ISNUMBER(SEARCH(\"Start&End\",B271)),SUM(P271:INDEX(P271:P375,MATCH(TRUE,(B271:B375=\"Start&End\"),0))),SUM(P271:INDEX(P271:P375,MATCH(TRUE,(B271:B375=\"End\"),0)))))","v":""},{"$f":"IF(C271=\"\",\"\",IF(ISNUMBER(SEARCH(\"Start&End\",B271)),SUM(Q271:INDEX(Q271:Q375,MATCH(TRUE,(B271:B375=\"Start&End\"),0))),SUM(Q271:INDEX(Q271:Q375,MATCH(TRUE,(B271:B375=\"End\"),0)))))","v":""},"",null,null,null,null,null,null,"","","","","","","","",null,"","","","","","","",null,"","","","","","","",null,"","","","","","","",null,"","","","","","",""]
[270,null,null,null,null,null,null,null,null,null,null,null,"","","","","",{"$f":"IF(C272=\"\",\"\",IF(ISNUMBER(SEARCH(\"Start&End\",B272)),SUM(P272:INDEX(P272:P376,MATCH(TRUE,(B272:B376=\"Start&End\"),0))),SUM(P272:INDEX(P272:P376,MATCH(TRUE,(B272:B376=\"End\"),0)))))","v":""},{"$f":"IF(C272=\"\",\"\",IF(ISNUMBER(SEARCH(\"Start&End\",B272)),SUM(Q272:INDEX(Q272:Q376,MATCH(TRUE,(B272:B376=\"Start&End\"),0))),SUM(Q272:INDEX(Q272:Q376,MATCH(TRUE,(B272:B376=\"End\"),0)))))","v":""},"",null,null,null,null,null,null,"","","","","","","","",null,"","","","","","","",null,"","","","","","","",null,"","","","","","","",null,"","","","","","",""]
[271,null,null,null,null,null,null,null,null,null,null,null,"","","","","",{"$f":"IF(C273=\"\",\"\",IF(ISNUMBER(SEARCH(\"Start&End\",B273)),SUM(P273:INDEX(P273:P377,MATCH(TRUE,(B273:B377=\"Start&End\"),0))),SUM(P273:INDEX(P273:P377,MATCH(TRUE,(B273:B377=\"End\"),0)))))","v":""},{"$f":"IF(C273=\"\",\"\",IF(ISNUMBER(SEARCH(\"Start&End\",B273)),SUM(Q273:INDEX(Q273:Q377,MATCH(TRUE,(B273:B377=\"Start&End\"),0))),SUM(Q273:INDEX(Q273:Q377,MATCH(TRUE,(B273:B377=\"End\"),0)))))","v":""},"",null,null,null,null,null,null,"","","","","","","","",null,"","","","","","","",null,"","","","","","","",null,"","","","","","","",null,"","","","","","",""]
[272,null,null,null,null,null,null,null,null,null,null,null,"","","","","",{"$f":"IF(C274=\"\",\"\",IF(ISNUMBER(SEARCH(\"Start&End\",B274)),SUM(P274:INDEX(P274:P378,MATCH(TRUE,(B274:B378=\"Start&End\"),0))),SUM(P274:INDEX(P274:P378,MATCH(TRUE,(B274:B378=\"End\"),0)))))","v":""},{"$f":"IF(C274=\"\",\"\",IF(ISNUMBER(SEARCH(\"Start&End\",B274)),SUM(Q274:INDEX(Q274:Q378,MATCH(TRUE,(B274:B378=\"Start&End\"),0))),SUM(Q274:INDEX(Q274:Q378,MATCH(TRUE,(B274:B378=\"End\"),0)))))","v":""},"",null,null,null,null,null,null,"","","","","","","","",null,"","","","","","","",null,"","","","","","","",null,"","","","","","","",null,"","","","","","",""]
[273,null,null,null,null,null,null,null,null,null,null,null,"","","","","",{"$f":"IF(C275=\"\",\"\",IF(ISNUMBER(SEARCH(\"Start&End\",B275)),SUM(P275:INDEX(P275:P379,MATCH(TRUE,(B275:B379=\"Start&End\"),0))),SUM(P275:INDEX(P275:P379,MATCH(TRUE,(B275:B379=\"End\"),0)))))","v":""},{"$f":"IF(C275=\"\",\"\",IF(ISNUMBER(SEARCH(\"Start&End\",B275)),SUM(Q275:INDEX(Q275:Q379,MATCH(TRUE,(B275:B379=\"Start&End\"),0))),SUM(Q275:INDEX(Q275:Q379,MATCH(TRUE,(B275:B379=\"End\"),0)))))","v":""},"",null,null,null,null,null,null,"","","","","","","","",null,"","","","","","","",null,"","","","","","","",null,"","","","","","","",null,"","","","","","",""]
[274,null,null,null,null,null,null,null,null,null,null,null,"","","","","",{"$f":"IF(C276=\"\",\"\",IF(ISNUMBER(SEARCH(\"Start&End\",B276)),SUM(P276:INDEX(P276:P380,MATCH(TRUE,(B276:B380=\"Start&End\"),0))),SUM(P276:INDEX(P276:P380,MATCH(TRUE,(B276:B380=\"End\"),0)))))","v":""},{"$f":"IF(C276=\"\",\"\",IF(ISNUMBER(SEARCH(\"Start&End\",B276)),SUM(Q276:INDEX(Q276:Q380,MATCH(TRUE,(B276:B380=\"Start&End\"),0))),SUM(Q276:INDEX(Q276:Q380,MATCH(TRUE,(B276:B380=\"End\"),0)))))","v":""},"",null,null,null,null,null,null,"","","","","","","","",null,"","","","","","","",null,"","","","","","","",null,"","","","","","","",null,"","","","","","",""]
[275,null,null,null,null,null,null,null,null,null,null,null,"","","","","",{"$f":"IF(C277=\"\",\"\",IF(ISNUMBER(SEARCH(\"Start&End\",B277)),SUM(P277:INDEX(P277:P381,MATCH(TRUE,(B277:B381=\"Start&End\"),0))),SUM(P277:INDEX(P277:P381,MATCH(TRUE,(B277:B381=\"End\"),0)))))","v":""},{"$f":"IF(C277=\"\",\"\",IF(ISNUMBER(SEARCH(\"Start&End\",B277)),SUM(Q277:INDEX(Q277:Q381,MATCH(TRUE,(B277:B381=\"Start&End\"),0))),SUM(Q277:INDEX(Q277:Q381,MATCH(TRUE,(B277:B381=\"End\"),0)))))","v":""},"",null,null,null,null,null,null,"","","","","","","","",null,"","","","","","","",null,"","","","","","","",null,"","","","","","","",null,"","","","","","",""]
[276,null,null,null,null,null,null,null,null,null,null,null,"","","","","",{"$f":"IF(C278=\"\",\"\",IF(ISNUMBER(SEARCH(\"Start&End\",B278)),SUM(P278:INDEX(P278:P382,MATCH(TRUE,(B278:B382=\"Start&End\"),0))),SUM(P278:INDEX(P278:P382,MATCH(TRUE,(B278:B382=\"End\"),0)))))","v":""},{"$f":"IF(C278=\"\",\"\",IF(ISNUMBER(SEARCH(\"Start&End\",B278)),SUM(Q278:INDEX(Q278:Q382,MATCH(TRUE,(B278:B382=\"Start&End\"),0))),SUM(Q278:INDEX(Q278:Q382,MATCH(TRUE,(B278:B382=\"End\"),0)))))","v":""},"",null,null,null,null,null,null,"","","","","","","","",null,"","","","","","","",null,"","","","","","","",null,"","","","","","","",null,"","","","","","",""]
[277,null,null,null,null,null,null,null,null,null,null,null,"","","","","",{"$f":"IF(C279=\"\",\"\",IF(ISNUMBER(SEARCH(\"Start&End\",B279)),SUM(P279:INDEX(P279:P383,MATCH(TRUE,(B279:B383=\"Start&End\"),0))),SUM(P279:INDEX(P279:P383,MATCH(TRUE,(B279:B383=\"End\"),0)))))","v":""},{"$f":"IF(C279=\"\",\"\",IF(ISNUMBER(SEARCH(\"Start&End\",B279)),SUM(Q279:INDEX(Q279:Q383,MATCH(TRUE,(B279:B383=\"Start&End\"),0))),SUM(Q279:INDEX(Q279:Q383,MATCH(TRUE,(B279:B383=\"End\"),0)))))","v":""},"",null,null,null,null,null,null,"","","","","","","","",null,"","","","","","","",null,"","","","","","","",null,"","","","","","","",null,"","","","","","",""]
[278,null,null,null,null,null,null,null,null,null,null,null,"","","","","",{"$f":"IF(C280=\"\",\"\",IF(ISNUMBER(SEARCH(\"Start&End\",B280)),SUM(P280:INDEX(P280:P384,MATCH(TRUE,(B280:B384=\"Start&End\"),0))),SUM(P280:INDEX(P280:P384,MATCH(TRUE,(B280:B384=\"End\"),0)))))","v":""},{"$f":"IF(C280=\"\",\"\",IF(ISNUMBER(SEARCH(\"Start&End\",B280)),SUM(Q280:INDEX(Q280:Q384,MATCH(TRUE,(B280:B384=\"Start&End\"),0))),SUM(Q280:INDEX(Q280:Q384,MATCH(TRUE,(B280:B384=\"End\"),0)))))","v":""},"",null,null,null,null,null,null,"","","","","","","","",null,"","","","","","","",null,"","","","","","","",null,"","","","","","","",null,"","","","","","",""]
[279,null,null,null,null,null,null,null,null,null,null,null,"","","","","",{"$f":"IF(C281=\"\",\"\",IF(ISNUMBER(SEARCH(\"Start&End\",B281)),SUM(P281:INDEX(P281:P385,MATCH(TRUE,(B281:B385=\"Start&End\"),0))),SUM(P281:INDEX(P281:P385,MATCH(TRUE,(B281:B385=\"End\"),0)))))","v":""},{"$f":"IF(C281=\"\",\"\",IF(ISNUMBER(SEARCH(\"Start&End\",B281)),SUM(Q281:INDEX(Q281:Q385,MATCH(TRUE,(B281:B385=\"Start&End\"),0))),SUM(Q281:INDEX(Q281:Q385,MATCH(TRUE,(B281:B385=\"End\"),0)))))","v":""},"",null,null,null,null,null,null,"","","","","","","","",null,"","","","","","","",null,"","","","","","","",null,"","","","","","","",null,"","","","","","",""]
[280,null,null,null,null,null,null,null,null,null,null,null,"","","","","",{"$f":"IF(C282=\"\",\"\",IF(ISNUMBER(SEARCH(\"Start&End\",B282)),SUM(P282:INDEX(P282:P386,MATCH(TRUE,(B282:B386=\"Start&End\"),0))),SUM(P282:INDEX(P282:P386,MATCH(TRUE,(B282:B386=\"End\"),0)))))","v":""},{"$f":"IF(C282=\"\",\"\",IF(ISNUMBER(SEARCH(\"Start&End\",B282)),SUM(Q282:INDEX(Q282:Q386,MATCH(TRUE,(B282:B386=\"Start&End\"),0))),SUM(Q282:INDEX(Q282:Q386,MATCH(TRUE,(B282:B386=\"End\"),0)))))","v":""},"",null,null,null,null,null,null,"","","","","","","","",null,"","","","","","","",null,"","","","","","","",null,"","","","","","","",null,"","","","","","",""]
[281,null,null,null,null,null,null,null,null,null,null,null,"","","","","",{"$f":"IF(C283=\"\",\"\",IF(ISNUMBER(SEARCH(\"Start&End\",B283)),SUM(P283:INDEX(P283:P387,MATCH(TRUE,(B283:B387=\"Start&End\"),0))),SUM(P283:INDEX(P283:P387,MATCH(TRUE,(B283:B387=\"End\"),0)))))","v":""},{"$f":"IF(C283=\"\",\"\",IF(ISNUMBER(SEARCH(\"Start&End\",B283)),SUM(Q283:INDEX(Q283:Q387,MATCH(TRUE,(B283:B387=\"Start&End\"),0))),SUM(Q283:INDEX(Q283:Q387,MATCH(TRUE,(B283:B387=\"End\"),0)))))","v":""},"",null,null,null,null,null,null,"","","","","","","","",null,"","","","","","","",null,"","","","","","","",null,"","","","","","","",null,"","","","","","",""]
[282,null,null,null,null,null,null,null,null,null,null,null,"","","","","",{"$f":"IF(C284=\"\",\"\",IF(ISNUMBER(SEARCH(\"Start&End\",B284)),SUM(P284:INDEX(P284:P388,MATCH(TRUE,(B284:B388=\"Start&End\"),0))),SUM(P284:INDEX(P284:P388,MATCH(TRUE,(B284:B388=\"End\"),0)))))","v":""},{"$f":"IF(C284=\"\",\"\",IF(ISNUMBER(SEARCH(\"Start&End\",B284)),SUM(Q284:INDEX(Q284:Q388,MATCH(TRUE,(B284:B388=\"Start&End\"),0))),SUM(Q284:INDEX(Q284:Q388,MATCH(TRUE,(B284:B388=\"End\"),0)))))","v":""},"",null,null,null,null,null,null,"","","","","","","","",null,"","","","","","","",null,"","","","","","","",null,"","","","","","","",null,"","","","","","",""]
[283,null,null,null,null,null,null,null,null,null,null,null,"","","","","",{"$f":"IF(C285=\"\",\"\",IF(ISNUMBER(SEARCH(\"Start&End\",B285)),SUM(P285:INDEX(P285:P389,MATCH(TRUE,(B285:B389=\"Start&End\"),0))),SUM(P285:INDEX(P285:P389,MATCH(TRUE,(B285:B389=\"End\"),0)))))","v":""},{"$f":"IF(C285=\"\",\"\",IF(ISNUMBER(SEARCH(\"Start&End\",B285)),SUM(Q285:INDEX(Q285:Q389,MATCH(TRUE,(B285:B389=\"Start&End\"),0))),SUM(Q285:INDEX(Q285:Q389,MATCH(TRUE,(B285:B389=\"End\"),0)))))","v":""},"",null,null,null,null,null,null,"","","","","","","","",null,"","","","","","","",null,"","","","","","","",null,"","","","","","","",null,"","","","","","",""]
[284,null,null,null,null,null,null,null,null,null,null,null,"","","","","",{"$f":"IF(C286=\"\",\"\",IF(ISNUMBER(SEARCH(\"Start&End\",B286)),SUM(P286:INDEX(P286:P390,MATCH(TRUE,(B286:B390=\"Start&End\"),0))),SUM(P286:INDEX(P286:P390,MATCH(TRUE,(B286:B390=\"End\"),0)))))","v":""},{"$f":"IF(C286=\"\",\"\",IF(ISNUMBER(SEARCH(\"Start&End\",B286)),SUM(Q286:INDEX(Q286:Q390,MATCH(TRUE,(B286:B390=\"Start&End\"),0))),SUM(Q286:INDEX(Q286:Q390,MATCH(TRUE,(B286:B390=\"End\"),0)))))","v":""},"",null,null,null,null,null,null,"","","","","","","","",null,"","","","","","","",null,"","","","","","","",null,"","","","","","","",null,"","","","","","",""]
[285,null,null,null,null,null,null,null,null,null,null,null,"","","","","",{"$f":"IF(C287=\"\",\"\",IF(ISNUMBER(SEARCH(\"Start&End\",B287)),SUM(P287:INDEX(P287:P391,MATCH(TRUE,(B287:B391=\"Start&End\"),0))),SUM(P287:INDEX(P287:P391,MATCH(TRUE,(B287:B391=\"End\"),0)))))","v":""},{"$f":"IF(C287=\"\",\"\",IF(ISNUMBER(SEARCH(\"Start&End\",B287)),SUM(Q287:INDEX(Q287:Q391,MATCH(TRUE,(B287:B391=\"Start&End\"),0))),SUM(Q287:INDEX(Q287:Q391,MATCH(TRUE,(B287:B391=\"End\"),0)))))","v":""},"",null,null,null,null,null,null,"","","","","","","","",null,"","","","","","","",null,"","","","","","","",null,"","","","","","","",null,"","","","","","",""]
[286,null,null,null,null,null,null,null,null,null,null,null,"","","","","",{"$f":"IF(C288=\"\",\"\",IF(ISNUMBER(SEARCH(\"Start&End\",B288)),SUM(P288:INDEX(P288:P392,MATCH(TRUE,(B288:B392=\"Start&End\"),0))),SUM(P288:INDEX(P288:P392,MATCH(TRUE,(B288:B392=\"End\"),0)))))","v":""},{"$f":"IF(C288=\"\",\"\",IF(ISNUMBER(SEARCH(\"Start&End\",B288)),SUM(Q288:INDEX(Q288:Q392,MATCH(TRUE,(B288:B392=\"Start&End\"),0))),SUM(Q288:INDEX(Q288:Q392,MATCH(TRUE,(B288:B392=\"End\"),0)))))","v":""},"",null,null,null,null,null,null,"","","","","","","","",null,"","","","","","","",null,"","","","","","","",null,"","","","","","","",null,"","","","","","",""]
[287,null,null,null,null,null,null,null,null,null,null,null,"","","","","",{"$f":"IF(C289=\"\",\"\",IF(ISNUMBER(SEARCH(\"Start&End\",B289)),SUM(P289:INDEX(P289:P393,MATCH(TRUE,(B289:B393=\"Start&End\"),0))),SUM(P289:INDEX(P289:P393,MATCH(TRUE,(B289:B393=\"End\"),0)))))","v":""},{"$f":"IF(C289=\"\",\"\",IF(ISNUMBER(SEARCH(\"Start&End\",B289)),SUM(Q289:INDEX(Q289:Q393,MATCH(TRUE,(B289:B393=\"Start&End\"),0))),SUM(Q289:INDEX(Q289:Q393,MATCH(TRUE,(B289:B393=\"End\"),0)))))","v":""},"",null,null,null,null,null,null,"","","","","","","","",null,"","","","","","","",null,"","","","","","","",null,"","","","","","","",null,"","","","","","",""]
[288,null,null,null,null,null,null,null,null,null,null,null,"","","","","",{"$f":"IF(C290=\"\",\"\",IF(ISNUMBER(SEARCH(\"Start&End\",B290)),SUM(P290:INDEX(P290:P394,MATCH(TRUE,(B290:B394=\"Start&End\"),0))),SUM(P290:INDEX(P290:P394,MATCH(TRUE,(B290:B394=\"End\"),0)))))","v":""},{"$f":"IF(C290=\"\",\"\",IF(ISNUMBER(SEARCH(\"Start&End\",B290)),SUM(Q290:INDEX(Q290:Q394,MATCH(TRUE,(B290:B394=\"Start&End\"),0))),SUM(Q290:INDEX(Q290:Q394,MATCH(TRUE,(B290:B394=\"End\"),0)))))","v":""},"",null,null,null,null,null,null,"","","","","","","","",null,"","","","","","","",null,"","","","","","","",null,"","","","","","","",null,"","","","","","",""]
[289,null,null,null,null,null,null,null,null,null,null,null,"","","","","",{"$f":"IF(C291=\"\",\"\",IF(ISNUMBER(SEARCH(\"Start&End\",B291)),SUM(P291:INDEX(P291:P395,MATCH(TRUE,(B291:B395=\"Start&End\"),0))),SUM(P291:INDEX(P291:P395,MATCH(TRUE,(B291:B395=\"End\"),0)))))","v":""},{"$f":"IF(C291=\"\",\"\",IF(ISNUMBER(SEARCH(\"Start&End\",B291)),SUM(Q291:INDEX(Q291:Q395,MATCH(TRUE,(B291:B395=\"Start&End\"),0))),SUM(Q291:INDEX(Q291:Q395,MATCH(TRUE,(B291:B395=\"End\"),0)))))","v":""},"",null,null,null,null,null,null,"","","","","","","","",null,"","","","","","","",null,"","","","","","","",null,"","","","","","","",null,"","","","","","",""]
[290,null,null,null,null,null,null,null,null,null,null,null,"","","","","",{"$f":"IF(C292=\"\",\"\",IF(ISNUMBER(SEARCH(\"Start&End\",B292)),SUM(P292:INDEX(P292:P396,MATCH(TRUE,(B292:B396=\"Start&End\"),0))),SUM(P292:INDEX(P292:P396,MATCH(TRUE,(B292:B396=\"End\"),0)))))","v":""},{"$f":"IF(C292=\"\",\"\",IF(ISNUMBER(SEARCH(\"Start&End\",B292)),SUM(Q292:INDEX(Q292:Q396,MATCH(TRUE,(B292:B396=\"Start&End\"),0))),SUM(Q292:INDEX(Q292:Q396,MATCH(TRUE,(B292:B396=\"End\"),0)))))","v":""},"",null,null,null,null,null,null,"","","","","","","","",null,"","","","","","","",null,"","","","","","","",null,"","","","","","","",null,"","","","","","",""]
[291,null,null,null,null,null,null,null,null,null,null,null,"","","","","",{"$f":"IF(C293=\"\",\"\",IF(ISNUMBER(SEARCH(\"Start&End\",B293)),SUM(P293:INDEX(P293:P397,MATCH(TRUE,(B293:B397=\"Start&End\"),0))),SUM(P293:INDEX(P293:P397,MATCH(TRUE,(B293:B397=\"End\"),0)))))","v":""},{"$f":"IF(C293=\"\",\"\",IF(ISNUMBER(SEARCH(\"Start&End\",B293)),SUM(Q293:INDEX(Q293:Q397,MATCH(TRUE,(B293:B397=\"Start&End\"),0))),SUM(Q293:INDEX(Q293:Q397,MATCH(TRUE,(B293:B397=\"End\"),0)))))","v":""},"",null,null,null,null,null,null,"","","","","","","","",null,"","","","","","","",null,"","","","","","","",null,"","","","","","","",null,"","","","","","",""]
[292,null,null,null,null,null,null,null,null,null,null,null,"","","","","",{"$f":"IF(C294=\"\",\"\",IF(ISNUMBER(SEARCH(\"Start&End\",B294)),SUM(P294:INDEX(P294:P398,MATCH(TRUE,(B294:B398=\"Start&End\"),0))),SUM(P294:INDEX(P294:P398,MATCH(TRUE,(B294:B398=\"End\"),0)))))","v":""},{"$f":"IF(C294=\"\",\"\",IF(ISNUMBER(SEARCH(\"Start&End\",B294)),SUM(Q294:INDEX(Q294:Q398,MATCH(TRUE,(B294:B398=\"Start&End\"),0))),SUM(Q294:INDEX(Q294:Q398,MATCH(TRUE,(B294:B398=\"End\"),0)))))","v":""},"",null,null,null,null,null,null,"","","","","","","","",null,"","","","","","","",null,"","","","","","","",null,"","","","","","","",null,"","","","","","",""]
[293,null,null,null,null,null,null,null,null,null,null,null,"","","","","",{"$f":"IF(C295=\"\",\"\",IF(ISNUMBER(SEARCH(\"Start&End\",B295)),SUM(P295:INDEX(P295:P399,MATCH(TRUE,(B295:B399=\"Start&End\"),0))),SUM(P295:INDEX(P295:P399,MATCH(TRUE,(B295:B399=\"End\"),0)))))","v":""},{"$f":"IF(C295=\"\",\"\",IF(ISNUMBER(SEARCH(\"Start&End\",B295)),SUM(Q295:INDEX(Q295:Q399,MATCH(TRUE,(B295:B399=\"Start&End\"),0))),SUM(Q295:INDEX(Q295:Q399,MATCH(TRUE,(B295:B399=\"End\"),0)))))","v":""},"",null,null,null,null,null,null,"","","","","","","","",null,"","","","","","","",null,"","","","","","","",null,"","","","","","","",null,"","","","","","",""]
[294,null,null,null,null,null,null,null,null,null,null,null,"","","","","",{"$f":"IF(C296=\"\",\"\",IF(ISNUMBER(SEARCH(\"Start&End\",B296)),SUM(P296:INDEX(P296:P400,MATCH(TRUE,(B296:B400=\"Start&End\"),0))),SUM(P296:INDEX(P296:P400,MATCH(TRUE,(B296:B400=\"End\"),0)))))","v":""},{"$f":"IF(C296=\"\",\"\",IF(ISNUMBER(SEARCH(\"Start&End\",B296)),SUM(Q296:INDEX(Q296:Q400,MATCH(TRUE,(B296:B400=\"Start&End\"),0))),SUM(Q296:INDEX(Q296:Q400,MATCH(TRUE,(B296:B400=\"End\"),0)))))","v":""},"",null,null,null,null,null,null,"","","","","","","","",null,"","","","","","","",null,"","","","","","","",null,"","","","","","","",null,"","","","","","",""]
[295,null,null,null,null,null,null,null,null,null,null,null,"","","","","",{"$f":"IF(C297=\"\",\"\",IF(ISNUMBER(SEARCH(\"Start&End\",B297)),SUM(P297:INDEX(P297:P401,MATCH(TRUE,(B297:B401=\"Start&End\"),0))),SUM(P297:INDEX(P297:P401,MATCH(TRUE,(B297:B401=\"End\"),0)))))","v":""},{"$f":"IF(C297=\"\",\"\",IF(ISNUMBER(SEARCH(\"Start&End\",B297)),SUM(Q297:INDEX(Q297:Q401,MATCH(TRUE,(B297:B401=\"Start&End\"),0))),SUM(Q297:INDEX(Q297:Q401,MATCH(TRUE,(B297:B401=\"End\"),0)))))","v":""},"",null,null,null,null,null,null,"","","","","","","","",null,"","","","","","","",null,"","","","","","","",null,"","","","","","","",null,"","","","","","",""]
[296,null,null,null,null,null,null,null,null,null,null,null,"","","","","",{"$f":"IF(C298=\"\",\"\",IF(ISNUMBER(SEARCH(\"Start&End\",B298)),SUM(P298:INDEX(P298:P402,MATCH(TRUE,(B298:B402=\"Start&End\"),0))),SUM(P298:INDEX(P298:P402,MATCH(TRUE,(B298:B402=\"End\"),0)))))","v":""},{"$f":"IF(C298=\"\",\"\",IF(ISNUMBER(SEARCH(\"Start&End\",B298)),SUM(Q298:INDEX(Q298:Q402,MATCH(TRUE,(B298:B402=\"Start&End\"),0))),SUM(Q298:INDEX(Q298:Q402,MATCH(TRUE,(B298:B402=\"End\"),0)))))","v":""},"",null,null,null,null,null,null,"","","","","","","","",null,"","","","","","","",null,"","","","","","","",null,"","","","","","","",null,"","","","","","",""]
[297,null,null,null,null,null,null,null,null,null,null,null,"","","","","",{"$f":"IF(C299=\"\",\"\",IF(ISNUMBER(SEARCH(\"Start&End\",B299)),SUM(P299:INDEX(P299:P403,MATCH(TRUE,(B299:B403=\"Start&End\"),0))),SUM(P299:INDEX(P299:P403,MATCH(TRUE,(B299:B403=\"End\"),0)))))","v":""},{"$f":"IF(C299=\"\",\"\",IF(ISNUMBER(SEARCH(\"Start&End\",B299)),SUM(Q299:INDEX(Q299:Q403,MATCH(TRUE,(B299:B403=\"Start&End\"),0))),SUM(Q299:INDEX(Q299:Q403,MATCH(TRUE,(B299:B403=\"End\"),0)))))","v":""},"",null,null,null,null,null,null,"","","","","","","","",null,"","","","","","","",null,"","","","","","","",null,"","","","","","","",null,"","","","","","",""]
[298,null,null,null,null,null,null,null,null,null,null,null,"","","","","",{"$f":"IF(C300=\"\",\"\",IF(ISNUMBER(SEARCH(\"Start&End\",B300)),SUM(P300:INDEX(P300:P404,MATCH(TRUE,(B300:B404=\"Start&End\"),0))),SUM(P300:INDEX(P300:P404,MATCH(TRUE,(B300:B404=\"End\"),0)))))","v":""},{"$f":"IF(C300=\"\",\"\",IF(ISNUMBER(SEARCH(\"Start&End\",B300)),SUM(Q300:INDEX(Q300:Q404,MATCH(TRUE,(B300:B404=\"Start&End\"),0))),SUM(Q300:INDEX(Q300:Q404,MATCH(TRUE,(B300:B404=\"End\"),0)))))","v":""},"",null,null,null,null,null,null,"","","","","","","","",null,"","","","","","","",null,"","","","","","","",null,"","","","","","","",null,"","","","","","",""]
[299,null,null,null,null,null,null,null,null,null,null,null,"","","","","",{"$f":"IF(C301=\"\",\"\",IF(ISNUMBER(SEARCH(\"Start&End\",B301)),SUM(P301:INDEX(P301:P405,MATCH(TRUE,(B301:B405=\"Start&End\"),0))),SUM(P301:INDEX(P301:P405,MATCH(TRUE,(B301:B405=\"End\"),0)))))","v":""},{"$f":"IF(C301=\"\",\"\",IF(ISNUMBER(SEARCH(\"Start&End\",B301)),SUM(Q301:INDEX(Q301:Q405,MATCH(TRUE,(B301:B405=\"Start&End\"),0))),SUM(Q301:INDEX(Q301:Q405,MATCH(TRUE,(B301:B405=\"End\"),0)))))","v":""},"",null,null,null,null,null,null,"","","","","","","","",null,"","","","","","","",null,"","","","","","","",null,"","","","","","","",null,"","","","","","",""]
[300,null,null,null,null,null,null,null,null,null,null,null,"","","","","",{"$f":"IF(C302=\"\",\"\",IF(ISNUMBER(SEARCH(\"Start&End\",B302)),SUM(P302:INDEX(P302:P406,MATCH(TRUE,(B302:B406=\"Start&End\"),0))),SUM(P302:INDEX(P302:P406,MATCH(TRUE,(B302:B406=\"End\"),0)))))","v":""},{"$f":"IF(C302=\"\",\"\",IF(ISNUMBER(SEARCH(\"Start&End\",B302)),SUM(Q302:INDEX(Q302:Q406,MATCH(TRUE,(B302:B406=\"Start&End\"),0))),SUM(Q302:INDEX(Q302:Q406,MATCH(TRUE,(B302:B406=\"End\"),0)))))","v":""},"",null,null,null,null,null,null,"","","","","","","","",null,"","","","","","","",null,"","","","","","","",null,"","","","","","","",null,"","","","","","",""]
[301,null,null,null,null,null,null,null,null,null,null,null,"","","","","",{"$f":"IF(C303=\"\",\"\",IF(ISNUMBER(SEARCH(\"Start&End\",B303)),SUM(P303:INDEX(P303:P407,MATCH(TRUE,(B303:B407=\"Start&End\"),0))),SUM(P303:INDEX(P303:P407,MATCH(TRUE,(B303:B407=\"End\"),0)))))","v":""},{"$f":"IF(C303=\"\",\"\",IF(ISNUMBER(SEARCH(\"Start&End\",B303)),SUM(Q303:INDEX(Q303:Q407,MATCH(TRUE,(B303:B407=\"Start&End\"),0))),SUM(Q303:INDEX(Q303:Q407,MATCH(TRUE,(B303:B407=\"End\"),0)))))","v":""},"",null,null,null,null,null,null,"","","","","","","","",null,"","","","","","","",null,"","","","","","","",null,"","","","","","","",null,"","","","","","",""]
[302,null,null,null,null,null,null,null,null,null,null,null,"","","","","",{"$f":"IF(C304=\"\",\"\",IF(ISNUMBER(SEARCH(\"Start&End\",B304)),SUM(P304:INDEX(P304:P408,MATCH(TRUE,(B304:B408=\"Start&End\"),0))),SUM(P304:INDEX(P304:P408,MATCH(TRUE,(B304:B408=\"End\"),0)))))","v":""},{"$f":"IF(C304=\"\",\"\",IF(ISNUMBER(SEARCH(\"Start&End\",B304)),SUM(Q304:INDEX(Q304:Q408,MATCH(TRUE,(B304:B408=\"Start&End\"),0))),SUM(Q304:INDEX(Q304:Q408,MATCH(TRUE,(B304:B408=\"End\"),0)))))","v":""},"",null,null,null,null,null,null,"","","","","","","","",null,"","","","","","","",null,"","","","","","","",null,"","","","","","","",null,"","","","","","",""]
[303,null,null,null,null,null,null,null,null,null,null,null,"","","","","",{"$f":"IF(C305=\"\",\"\",IF(ISNUMBER(SEARCH(\"Start&End\",B305)),SUM(P305:INDEX(P305:P409,MATCH(TRUE,(B305:B409=\"Start&End\"),0))),SUM(P305:INDEX(P305:P409,MATCH(TRUE,(B305:B409=\"End\"),0)))))","v":""},{"$f":"IF(C305=\"\",\"\",IF(ISNUMBER(SEARCH(\"Start&End\",B305)),SUM(Q305:INDEX(Q305:Q409,MATCH(TRUE,(B305:B409=\"Start&End\"),0))),SUM(Q305:INDEX(Q305:Q409,MATCH(TRUE,(B305:B409=\"End\"),0)))))","v":""},"",null,null,null,null,null,null,"","","","","","","","",null,"","","","","","","",null,"","","","","","","",null,"","","","","","","",null,"","","","","","",""]
[304,null,null,null,null,null,null,null,null,null,null,null,"","","","","",{"$f":"IF(C306=\"\",\"\",IF(ISNUMBER(SEARCH(\"Start&End\",B306)),SUM(P306:INDEX(P306:P410,MATCH(TRUE,(B306:B410=\"Start&End\"),0))),SUM(P306:INDEX(P306:P410,MATCH(TRUE,(B306:B410=\"End\"),0)))))","v":""},{"$f":"IF(C306=\"\",\"\",IF(ISNUMBER(SEARCH(\"Start&End\",B306)),SUM(Q306:INDEX(Q306:Q410,MATCH(TRUE,(B306:B410=\"Start&End\"),0))),SUM(Q306:INDEX(Q306:Q410,MATCH(TRUE,(B306:B410=\"End\"),0)))))","v":""},"",null,null,null,null,null,null,"","","","","","","","",null,"","","","","","","",null,"","","","","","","",null,"","","","","","","",null,"","","","","","",""]
[305,null,null,null,null,null,null,null,null,null,null,null,"","","","","",{"$f":"IF(C307=\"\",\"\",IF(ISNUMBER(SEARCH(\"Start&End\",B307)),SUM(P307:INDEX(P307:P411,MATCH(TRUE,(B307:B411=\"Start&End\"),0))),SUM(P307:INDEX(P307:P411,MATCH(TRUE,(B307:B411=\"End\"),0)))))","v":""},{"$f":"IF(C307=\"\",\"\",IF(ISNUMBER(SEARCH(\"Start&End\",B307)),SUM(Q307:INDEX(Q307:Q411,MATCH(TRUE,(B307:B411=\"Start&End\"),0))),SUM(Q307:INDEX(Q307:Q411,MATCH(TRUE,(B307:B411=\"End\"),0)))))","v":""},"",null,null,null,null,null,null,"","","","","","","","",null,"","","","","","","",null,"","","","","","","",null,"","","","","","","",null,"","","","","","",""]
[306,null,null,null,null,null,null,null,null,null,null,null,"","","","","",{"$f":"IF(C308=\"\",\"\",IF(ISNUMBER(SEARCH(\"Start&End\",B308)),SUM(P308:INDEX(P308:P412,MATCH(TRUE,(B308:B412=\"Start&End\"),0))),SUM(P308:INDEX(P308:P412,MATCH(TRUE,(B308:B412=\"End\"),0)))))","v":""},{"$f":"IF(C308=\"\",\"\",IF(ISNUMBER(SEARCH(\"Start&End\",B308)),SUM(Q308:INDEX(Q308:Q412,MATCH(TRUE,(B308:B412=\"Start&End\"),0))),SUM(Q308:INDEX(Q308:Q412,MATCH(TRUE,(B308:B412=\"End\"),0)))))","v":""},"",null,null,null,null,null,null,"","","","","","","","",null,"","","","","","","",null,"","","","","","","",null,"","","","","","","",null,"","","","","","",""]
[307,null,null,null,null,null,null,null,null,null,null,null,"","","","","",{"$f":"IF(C309=\"\",\"\",IF(ISNUMBER(SEARCH(\"Start&End\",B309)),SUM(P309:INDEX(P309:P413,MATCH(TRUE,(B309:B413=\"Start&End\"),0))),SUM(P309:INDEX(P309:P413,MATCH(TRUE,(B309:B413=\"End\"),0)))))","v":""},{"$f":"IF(C309=\"\",\"\",IF(ISNUMBER(SEARCH(\"Start&End\",B309)),SUM(Q309:INDEX(Q309:Q413,MATCH(TRUE,(B309:B413=\"Start&End\"),0))),SUM(Q309:INDEX(Q309:Q413,MATCH(TRUE,(B309:B413=\"End\"),0)))))","v":""},"",null,null,null,null,null,null,"","","","","","","","",null,"","","","","","","",null,"","","","","","","",null,"","","","","","","",null,"","","","","","",""]
[308,null,null,null,null,null,null,null,null,null,null,null,"","","","","",{"$f":"IF(C310=\"\",\"\",IF(ISNUMBER(SEARCH(\"Start&End\",B310)),SUM(P310:INDEX(P310:P414,MATCH(TRUE,(B310:B414=\"Start&End\"),0))),SUM(P310:INDEX(P310:P414,MATCH(TRUE,(B310:B414=\"End\"),0)))))","v":""},{"$f":"IF(C310=\"\",\"\",IF(ISNUMBER(SEARCH(\"Start&End\",B310)),SUM(Q310:INDEX(Q310:Q414,MATCH(TRUE,(B310:B414=\"Start&End\"),0))),SUM(Q310:INDEX(Q310:Q414,MATCH(TRUE,(B310:B414=\"End\"),0)))))","v":""},"",null,null,null,null,null,null,"","","","","","","","",null,"","","","","","","",null,"","","","","","","",null,"","","","","","","",null,"","","","","","",""]
[309,null,null,null,null,null,null,null,null,null,null,null,"","","","","",{"$f":"IF(C311=\"\",\"\",IF(ISNUMBER(SEARCH(\"Start&End\",B311)),SUM(P311:INDEX(P311:P415,MATCH(TRUE,(B311:B415=\"Start&End\"),0))),SUM(P311:INDEX(P311:P415,MATCH(TRUE,(B311:B415=\"End\"),0)))))","v":""},{"$f":"IF(C311=\"\",\"\",IF(ISNUMBER(SEARCH(\"Start&End\",B311)),SUM(Q311:INDEX(Q311:Q415,MATCH(TRUE,(B311:B415=\"Start&End\"),0))),SUM(Q311:INDEX(Q311:Q415,MATCH(TRUE,(B311:B415=\"End\"),0)))))","v":""},"",null,null,null,null,null,null,"","","","","","","","",null,"","","","","","","",null,"","","","","","","",null,"","","","","","","",null,"","","","","","",""]
[310,null,null,null,null,null,null,null,null,null,null,null,"","","","","",{"$f":"IF(C312=\"\",\"\",IF(ISNUMBER(SEARCH(\"Start&End\",B312)),SUM(P312:INDEX(P312:P416,MATCH(TRUE,(B312:B416=\"Start&End\"),0))),SUM(P312:INDEX(P312:P416,MATCH(TRUE,(B312:B416=\"End\"),0)))))","v":""},{"$f":"IF(C312=\"\",\"\",IF(ISNUMBER(SEARCH(\"Start&End\",B312)),SUM(Q312:INDEX(Q312:Q416,MATCH(TRUE,(B312:B416=\"Start&End\"),0))),SUM(Q312:INDEX(Q312:Q416,MATCH(TRUE,(B312:B416=\"End\"),0)))))","v":""},"",null,null,null,null,null,null,"","","","","","","","",null,"","","","","","","",null,"","","","","","","",null,"","","","","","","",null,"","","","","","",""]
[311,null,null,null,null,null,null,null,null,null,null,null,"","","","","",{"$f":"IF(C313=\"\",\"\",IF(ISNUMBER(SEARCH(\"Start&End\",B313)),SUM(P313:INDEX(P313:P417,MATCH(TRUE,(B313:B417=\"Start&End\"),0))),SUM(P313:INDEX(P313:P417,MATCH(TRUE,(B313:B417=\"End\"),0)))))","v":""},{"$f":"IF(C313=\"\",\"\",IF(ISNUMBER(SEARCH(\"Start&End\",B313)),SUM(Q313:INDEX(Q313:Q417,MATCH(TRUE,(B313:B417=\"Start&End\"),0))),SUM(Q313:INDEX(Q313:Q417,MATCH(TRUE,(B313:B417=\"End\"),0)))))","v":""},"",null,null,null,null,null,null,"","","","","","","","",null,"","","","","","","",null,"","","","","","","",null,"","","","","","","",null,"","","","","","",""]
[312,null,null,null,null,null,null,null,null,null,null,null,"","","","","",{"$f":"IF(C314=\"\",\"\",IF(ISNUMBER(SEARCH(\"Start&End\",B314)),SUM(P314:INDEX(P314:P418,MATCH(TRUE,(B314:B418=\"Start&End\"),0))),SUM(P314:INDEX(P314:P418,MATCH(TRUE,(B314:B418=\"End\"),0)))))","v":""},{"$f":"IF(C314=\"\",\"\",IF(ISNUMBER(SEARCH(\"Start&End\",B314)),SUM(Q314:INDEX(Q314:Q418,MATCH(TRUE,(B314:B418=\"Start&End\"),0))),SUM(Q314:INDEX(Q314:Q418,MATCH(TRUE,(B314:B418=\"End\"),0)))))","v":""},"",null,null,null,null,null,null,"","","","","","","","",null,"","","","","","","",null,"","","","","","","",null,"","","","","","","",null,"","","","","","",""]
[313,null,null,null,null,null,null,null,null,null,null,null,"","","","","",{"$f":"IF(C315=\"\",\"\",IF(ISNUMBER(SEARCH(\"Start&End\",B315)),SUM(P315:INDEX(P315:P419,MATCH(TRUE,(B315:B419=\"Start&End\"),0))),SUM(P315:INDEX(P315:P419,MATCH(TRUE,(B315:B419=\"End\"),0)))))","v":""},{"$f":"IF(C315=\"\",\"\",IF(ISNUMBER(SEARCH(\"Start&End\",B315)),SUM(Q315:INDEX(Q315:Q419,MATCH(TRUE,(B315:B419=\"Start&End\"),0))),SUM(Q315:INDEX(Q315:Q419,MATCH(TRUE,(B315:B419=\"End\"),0)))))","v":""},"",null,null,null,null,null,null,"","","","","","","","",null,"","","","","","","",null,"","","","","","","",null,"","","","","","","",null,"","","","","","",""]
[314,null,null,null,null,null,null,null,null,null,null,null,"","","","","",{"$f":"IF(C316=\"\",\"\",IF(ISNUMBER(SEARCH(\"Start&End\",B316)),SUM(P316:INDEX(P316:P420,MATCH(TRUE,(B316:B420=\"Start&End\"),0))),SUM(P316:INDEX(P316:P420,MATCH(TRUE,(B316:B420=\"End\"),0)))))","v":""},{"$f":"IF(C316=\"\",\"\",IF(ISNUMBER(SEARCH(\"Start&End\",B316)),SUM(Q316:INDEX(Q316:Q420,MATCH(TRUE,(B316:B420=\"Start&End\"),0))),SUM(Q316:INDEX(Q316:Q420,MATCH(TRUE,(B316:B420=\"End\"),0)))))","v":""},"",null,null,null,null,null,null,"","","","","","","","",null,"","","","","","","",null,"","","","","","","",null,"","","","","","","",null,"","","","","","",""]
[315,null,null,null,null,null,null,null,null,null,null,null,"","","","","",{"$f":"IF(C317=\"\",\"\",IF(ISNUMBER(SEARCH(\"Start&End\",B317)),SUM(P317:INDEX(P317:P421,MATCH(TRUE,(B317:B421=\"Start&End\"),0))),SUM(P317:INDEX(P317:P421,MATCH(TRUE,(B317:B421=\"End\"),0)))))","v":""},{"$f":"IF(C317=\"\",\"\",IF(ISNUMBER(SEARCH(\"Start&End\",B317)),SUM(Q317:INDEX(Q317:Q421,MATCH(TRUE,(B317:B421=\"Start&End\"),0))),SUM(Q317:INDEX(Q317:Q421,MATCH(TRUE,(B317:B421=\"End\"),0)))))","v":""},"",null,null,null,null,null,null,"","","","","","","","",null,"","","","","","","",null,"","","","","","","",null,"","","","","","","",null,"","","","","","",""]
[316,null,null,null,null,null,null,null,null,null,null,null,"","","","","",{"$f":"IF(C318=\"\",\"\",IF(ISNUMBER(SEARCH(\"Start&End\",B318)),SUM(P318:INDEX(P318:P422,MATCH(TRUE,(B318:B422=\"Start&End\"),0))),SUM(P318:INDEX(P318:P422,MATCH(TRUE,(B318:B422=\"End\"),0)))))","v":""},{"$f":"IF(C318=\"\",\"\",IF(ISNUMBER(SEARCH(\"Start&End\",B318)),SUM(Q318:INDEX(Q318:Q422,MATCH(TRUE,(B318:B422=\"Start&End\"),0))),SUM(Q318:INDEX(Q318:Q422,MATCH(TRUE,(B318:B422=\"End\"),0)))))","v":""},"",null,null,null,null,null,null,"","","","","","","","",null,"","","","","","","",null,"","","","","","","",null,"","","","","","","",null,"","","","","","",""]
[317,null,null,null,null,null,null,null,null,null,null,null,"","","","","",{"$f":"IF(C319=\"\",\"\",IF(ISNUMBER(SEARCH(\"Start&End\",B319)),SUM(P319:INDEX(P319:P423,MATCH(TRUE,(B319:B423=\"Start&End\"),0))),SUM(P319:INDEX(P319:P423,MATCH(TRUE,(B319:B423=\"End\"),0)))))","v":""},{"$f":"IF(C319=\"\",\"\",IF(ISNUMBER(SEARCH(\"Start&End\",B319)),SUM(Q319:INDEX(Q319:Q423,MATCH(TRUE,(B319:B423=\"Start&End\"),0))),SUM(Q319:INDEX(Q319:Q423,MATCH(TRUE,(B319:B423=\"End\"),0)))))","v":""},"",null,null,null,null,null,null,"","","","","","","","",null,"","","","","","","",null,"","","","","","","",null,"","","","","","","",null,"","","","","","",""]
[318,null,null,null,null,null,null,null,null,null,null,null,"","","","","",{"$f":"IF(C320=\"\",\"\",IF(ISNUMBER(SEARCH(\"Start&End\",B320)),SUM(P320:INDEX(P320:P424,MATCH(TRUE,(B320:B424=\"Start&End\"),0))),SUM(P320:INDEX(P320:P424,MATCH(TRUE,(B320:B424=\"End\"),0)))))","v":""},{"$f":"IF(C320=\"\",\"\",IF(ISNUMBER(SEARCH(\"Start&End\",B320)),SUM(Q320:INDEX(Q320:Q424,MATCH(TRUE,(B320:B424=\"Start&End\"),0))),SUM(Q320:INDEX(Q320:Q424,MATCH(TRUE,(B320:B424=\"End\"),0)))))","v":""},"",null,null,null,null,null,null,"","","","","","","","",null,"","","","","","","",null,"","","","","","","",null,"","","","","","","",null,"","","","","","",""]
[319,null,null,null,null,null,null,null,null,null,null,null,"","","","","",{"$f":"IF(C321=\"\",\"\",IF(ISNUMBER(SEARCH(\"Start&End\",B321)),SUM(P321:INDEX(P321:P425,MATCH(TRUE,(B321:B425=\"Start&End\"),0))),SUM(P321:INDEX(P321:P425,MATCH(TRUE,(B321:B425=\"End\"),0)))))","v":""},{"$f":"IF(C321=\"\",\"\",IF(ISNUMBER(SEARCH(\"Start&End\",B321)),SUM(Q321:INDEX(Q321:Q425,MATCH(TRUE,(B321:B425=\"Start&End\"),0))),SUM(Q321:INDEX(Q321:Q425,MATCH(TRUE,(B321:B425=\"End\"),0)))))","v":""},"",null,null,null,null,null,null,"","","","","","","","",null,"","","","","","","",null,"","","","","","","",null,"","","","","","","",null,"","","","","","",""]
[320,null,null,null,null,null,null,null,null,null,null,null,"","","","","",{"$f":"IF(C322=\"\",\"\",IF(ISNUMBER(SEARCH(\"Start&End\",B322)),SUM(P322:INDEX(P322:P426,MATCH(TRUE,(B322:B426=\"Start&End\"),0))),SUM(P322:INDEX(P322:P426,MATCH(TRUE,(B322:B426=\"End\"),0)))))","v":""},{"$f":"IF(C322=\"\",\"\",IF(ISNUMBER(SEARCH(\"Start&End\",B322)),SUM(Q322:INDEX(Q322:Q426,MATCH(TRUE,(B322:B426=\"Start&End\"),0))),SUM(Q322:INDEX(Q322:Q426,MATCH(TRUE,(B322:B426=\"End\"),0)))))","v":""},"",null,null,null,null,null,null,"","","","","","","","",null,"","","","","","","",null,"","","","","","","",null,"","","","","","","",null,"","","","","","",""]
[321,null,null,null,null,null,null,null,null,null,null,null,"","","","",{"$f":"IF(AA323=\"\",\"\",O323-P323)","v":""},{"$f":"IF(C323=\"\",\"\",IF(ISNUMBER(SEARCH(\"Start&End\",B323)),SUM(P323:INDEX(P323:P427,MATCH(TRUE,(B323:B427=\"Start&End\"),0))),SUM(P323:INDEX(P323:P427,MATCH(TRUE,(B323:B427=\"End\"),0)))))","v":""},{"$f":"IF(C323=\"\",\"\",IF(ISNUMBER(SEARCH(\"Start&End\",B323)),SUM(Q323:INDEX(Q323:Q427,MATCH(TRUE,(B323:B427=\"Start&End\"),0))),SUM(Q323:INDEX(Q323:Q427,MATCH(TRUE,(B323:B427=\"End\"),0)))))","v":""},{"$f":"IF(ISNUMBER(S323),S323,\"\")","v":""},null,null,null,null,null,null,{"$f":"IF((H323+I323)*G323=0,\"\",(H323+I323)*G323)","v":""},{"$f":"IF(ISNUMBER(SEARCH(\"FUT\",E323)),AZ323,IF(ISNUMBER(SEARCH(\"OPT\",E323)),BH323,IF(ISNUMBER(SEARCH(\"HOLD\",E323)),AJ323,AR323)))","v":""},{"$f":"IF(ISNUMBER(SEARCH(\"HOLD\",E323)),AK323,IF(ISNUMBER(SEARCH(\"INTRA\",E323)),AS323,IF(ISNUMBER(SEARCH(\"FUT\",E323)),BA323,BI323)))","v":""},{"$f":"IF(ISNUMBER(SEARCH(\"HOLD\",E323)),AL323,IF(ISNUMBER(SEARCH(\"INTRA\",E323)),AT323,IF(ISNUMBER(SEARCH(\"FUT\",E323)),BB323,BJ323)))","v":""},{"$f":"IF(ISNUMBER(SEARCH(\"HOLD\",E323)),AM323,IF(ISNUMBER(SEARCH(\"INTRA\",E323)),AU323,IF(ISNUMBER(SEARCH(\"FUT\",E323)),BC323,BK323)))","v":""},{"$f":"IF(ISNUMBER(SEARCH(\"HOLD\",E323)),AN323,IF(ISNUMBER(SEARCH(\"INTRA\",E323)),AV323,IF(ISNUMBER(SEARCH(\"FUT\",E323)),BD323,BL323)))","v":""},{"$f":"IF(ISNUMBER(SEARCH(\"HOLD\",E323)),AO323,IF(ISNUMBER(SEARCH(\"INTRA\",E323)),AW323,IF(ISNUMBER(SEARCH(\"FUT\",E323)),BE323,BM323)))","v":""},"",null,"","","","","",{"$f":"IF(G323&H323=\"\",\"\",ROUND(G323*H323*0.00015,2))","v":""},"",null,{"$f":"IF(MIN(20,((G323*H323*0.0003)))+MIN(20,((G323*H323*0.0003)))=0,\"\",MIN(20,((G323*H323*0.0003)))+MIN(20,((G323*H323*0.0003))))","v":""},{"$f":"IF(I323&G323=\"\",\"\",ROUND(I323*G323*0.00025,0))","v":""},"","","",{"$f":"IF(G323&H323=\"\",\"\",ROUND(G323*H323*0.00003,2))","v":""},"",null,{"$f":"IF(MIN(20,((G323*H323*0.0003)))+MIN(20,((G323*H323*0.0003)))=0,\"\",MIN(20,((G323*H323*0.0003)))+MIN(20,((G323*H323*0.0003))))","v":""},{"$f":"IF(I323&G323=\"\",\"\",ROUND(I323*G323*0.0001,0))","v":""},"","","",{"$f":"IF(G323&H323=\"\",\"\",ROUND(G323*H323*0.00002,2))","v":""},"",null,{"$f":"IF(AA323=\"\",\"\",40)","v":""},{"$f":"IF(I323&G323=\"\",\"\",ROUND(I323*G323*0.0005,0))","v":""},{"$f":"IF(AA323=\"\",\"\",ROUND(AA323*0.00053,2))","v":""},"",{"$f":"IF(AA323=\"\",\"\",ROUND((5/10000000)*AA323,2))","v":""},{"$f":"IF(G323&H323=\"\",\"\",ROUND(G323*H323*0.00003,2))","v":""},""]
[322,null,null,null,null,null,null,null,null,null,null,null,{"$f":"IF(OR(J324=\"\",K324=\"\"),\"\",IF(F324=\"Long\",  ((K324-H324)/(H324-J324)), ((I324-K324)/(J324-I324)) ))","v":""},{"$f":"IF(OR(I324=\"\",D324=\"\",H324=\"\",G324=\"\",E324=\"\",K324=\"\"),\"\",IF(I324=K324,\"Target Achieved\",IF(I324=J324,\"SL Hit\",IF(I324<J324,\"Extended SL Hit\",IF(I324>K324,\"Target Overachieved\",IF(AND(I324>=H324,I324<K324),\"Early Profit Exit\",\"Early Loss Exit\"))))))","v":""},{"$f":"IF(AA324=\"\",\"\",IF(OR(I324=\"\",H324=\"\"),0,G324*(I324-H324)))","v":""},{"$f":"IF(AH324=\"\",\"\",AH324)","v":""},"",{"$f":"IF(C324=\"\",\"\",IF(ISNUMBER(SEARCH(\"Start&End\",B324)),SUM(P324:INDEX(P324:P428,MATCH(TRUE,(B324:B428=\"Start&End\"),0))),SUM(P324:INDEX(P324:P428,MATCH(TRUE,(B324:B428=\"End\"),0)))))","v":""},{"$f":"IF(C324=\"\",\"\",IF(ISNUMBER(SEARCH(\"Start&End\",B324)),SUM(Q324:INDEX(Q324:Q428,MATCH(TRUE,(B324:B428=\"Start&End\"),0))),SUM(Q324:INDEX(Q324:Q428,MATCH(TRUE,(B324:B428=\"End\"),0)))))","v":""},"",null,null,null,null,null,null,"","","","","","","",{"$f":"IF(AB324&AC324&AD324&AE324&AF324&AG324=\"\",\"\",SUM(AB324:AG324))","v":""},null,{"$f":"IF(AA324=\"\",\"\",0)","v":""},{"$f":"IF(AA324=\"\",\"\",ROUND(AA324*0.001,2))","v":""},{"$f":"IF(AA324=\"\",\"\",ROUND(AA324*0.0000345,2))","v":""},{"$f":"IF(AJ324&AL324=\"\",\"\",ROUND((AJ324+AL324)*0.18,2))","v":""},{"$f":"IF(AA324=\"\",\"\",ROUND((5/10000000)*AA324,2))","v":""},"",{"$f":"IF(AK324&AL324&AM324&AN324&AO324=\"\",\"\",SUM(AK324:AO324))","v":""},null,"","",{"$f":"IF(AA324=\"\",\"\",ROUND(AA324*0.0000345,2))","v":""},{"$f":"IF(AR324&AT324=\"\",\"\",ROUND((AR324+AT324)*0.18,2))","v":""},{"$f":"IF(AA324=\"\",\"\",ROUND((5/10000000)*AA324,2))","v":""},"",{"$f":"IF(AR324&AS324&AT324&AU324&AV324&AW324=\"\",\"\",SUM(AR324:AW324))","v":""},null,"","",{"$f":"IF(AA324=\"\",\"\",ROUND(AA324*0.00002,2))","v":""},{"$f":"IF(AZ324&BB324=\"\",\"\",ROUND((AZ324+BB324)*0.18,2))","v":""},{"$f":"IF(AA324=\"\",\"\",ROUND((5/10000000)*AA324,2))","v":""},"","",null,"","","",{"$f":"IF(BH324&BJ324=\"\",\"\",ROUND((BH324+BJ324)*0.18,2))","v":""},"","",{"$f":"IF(BH324&BI324&BJ324&BK324&BL324&BM324=\"\",\"\",SUM(BH324:BM324))","v":""}]
[323,null,null,null,null,null,null,null,null,null,null,null,"","","","","",{"$f":"IF(C325=\"\",\"\",IF(ISNUMBER(SEARCH(\"Start&End\",B325)),SUM(P325:INDEX(P325:P429,MATCH(TRUE,(B325:B429=\"Start&End\"),0))),SUM(P325:INDEX(P325:P429,MATCH(TRUE,(B325:B429=\"End\"),0)))))","v":""},{"$f":"IF(C325=\"\",\"\",IF(ISNUMBER(SEARCH(\"Start&End\",B325)),SUM(Q325:INDEX(Q325:Q429,MATCH(TRUE,(B325:B429=\"Start&End\"),0))),SUM(Q325:INDEX(Q325:Q429,MATCH(TRUE,(B325:B429=\"End\"),0)))))","v":""},"",null,null,null,null,null,null,"","","","","","","","",null,"","","","","","","",null,"","","","","","","",null,"","","","","","",{"$f":"IF(FAX325&BA325&BB325&BC325&BD325&BE325=\"\",\"\",SUM(AZ325:BE325))","v":""},null,"","","","","","",""]
[324,null,null,null,null,null,null,null,null,null,null,null,"","","","","",{"$f":"IF(C326=\"\",\"\",IF(ISNUMBER(SEARCH(\"Start&End\",B326)),SUM(P326:INDEX(P326:P430,MATCH(TRUE,(B326:B430=\"Start&End\"),0))),SUM(P326:INDEX(P326:P430,MATCH(TRUE,(B326:B430=\"End\"),0)))))","v":""},{"$f":"IF(C326=\"\",\"\",IF(ISNUMBER(SEARCH(\"Start&End\",B326)),SUM(Q326:INDEX(Q326:Q430,MATCH(TRUE,(B326:B430=\"Start&End\"),0))),SUM(Q326:INDEX(Q326:Q430,MATCH(TRUE,(B326:B430=\"End\"),0)))))","v":""},"",null,null,null,null,null,null,"","","","","","","","",null,"","","","","","","",null,"","","","","","","",null,"","","","","","","",null,"","","","","","",""]
[325,null,null,null,null,null,null,null,null,null,null,null,"","","","","",{"$f":"IF(C327=\"\",\"\",IF(ISNUMBER(SEARCH(\"Start&End\",B327)),SUM(P327:INDEX(P327:P431,MATCH(TRUE,(B327:B431=\"Start&End\"),0))),SUM(P327:INDEX(P327:P431,MATCH(TRUE,(B327:B431=\"End\"),0)))))","v":""},{"$f":"IF(C327=\"\",\"\",IF(ISNUMBER(SEARCH(\"Start&End\",B327)),SUM(Q327:INDEX(Q327:Q431,MATCH(TRUE,(B327:B431=\"Start&End\"),0))),SUM(Q327:INDEX(Q327:Q431,MATCH(TRUE,(B327:B431=\"End\"),0)))))","v":""},"",null,null,null,null,null,null,"","","","","","","","",null,"","","","","","","",null,"","","","","","","",null,"","","","","","","",null,"","","","","","",""]
[326,null,null,null,null,null,null,null,null,null,null,null,"","","","","",{"$f":"IF(C328=\"\",\"\",IF(ISNUMBER(SEARCH(\"Start&End\",B328)),SUM(P328:INDEX(P328:P432,MATCH(TRUE,(B328:B432=\"Start&End\"),0))),SUM(P328:INDEX(P328:P432,MATCH(TRUE,(B328:B432=\"End\"),0)))))","v":""},{"$f":"IF(C328=\"\",\"\",IF(ISNUMBER(SEARCH(\"Start&End\",B328)),SUM(Q328:INDEX(Q328:Q432,MATCH(TRUE,(B328:B432=\"Start&End\"),0))),SUM(Q328:INDEX(Q328:Q432,MATCH(TRUE,(B328:B432=\"End\"),0)))))","v":""},"",null,null,null,null,null,null,"","","","","","","","",null,"","","","","","","",null,"","","","","","","",null,"","","","","","","",null,"","","","","","",""]
[327,null,null,null,null,null,null,null,null,null,null,null,"","","","","",{"$f":"IF(C329=\"\",\"\",IF(ISNUMBER(SEARCH(\"Start&End\",B329)),SUM(P329:INDEX(P329:P433,MATCH(TRUE,(B329:B433=\"Start&End\"),0))),SUM(P329:INDEX(P329:P433,MATCH(TRUE,(B329:B433=\"End\"),0)))))","v":""},{"$f":"IF(C329=\"\",\"\",IF(ISNUMBER(SEARCH(\"Start&End\",B329)),SUM(Q329:INDEX(Q329:Q433,MATCH(TRUE,(B329:B433=\"Start&End\"),0))),SUM(Q329:INDEX(Q329:Q433,MATCH(TRUE,(B329:B433=\"End\"),0)))))","v":""},"",null,null,null,null,null,null,"","","","","","","","",null,"","","","","","","",null,"","","","","","","",null,"","","","","","","",null,"","","","","","",""]
[328,null,null,null,null,null,null,null,null,null,null,null,"","","","","",{"$f":"IF(C330=\"\",\"\",IF(ISNUMBER(SEARCH(\"Start&End\",B330)),SUM(P330:INDEX(P330:P434,MATCH(TRUE,(B330:B434=\"Start&End\"),0))),SUM(P330:INDEX(P330:P434,MATCH(TRUE,(B330:B434=\"End\"),0)))))","v":""},{"$f":"IF(C330=\"\",\"\",IF(ISNUMBER(SEARCH(\"Start&End\",B330)),SUM(Q330:INDEX(Q330:Q434,MATCH(TRUE,(B330:B434=\"Start&End\"),0))),SUM(Q330:INDEX(Q330:Q434,MATCH(TRUE,(B330:B434=\"End\"),0)))))","v":""},"",null,null,null,null,null,null,"","","","","","","","",null,"","","","","","","",null,"","","","","","","",null,"","","","","","","",null,"","","","","","",""]
[329,null,null,null,null,null,null,null,null,null,null,null,"","","","","",{"$f":"IF(C331=\"\",\"\",IF(ISNUMBER(SEARCH(\"Start&End\",B331)),SUM(P331:INDEX(P331:P435,MATCH(TRUE,(B331:B435=\"Start&End\"),0))),SUM(P331:INDEX(P331:P435,MATCH(TRUE,(B331:B435=\"End\"),0)))))","v":""},{"$f":"IF(C331=\"\",\"\",IF(ISNUMBER(SEARCH(\"Start&End\",B331)),SUM(Q331:INDEX(Q331:Q435,MATCH(TRUE,(B331:B435=\"Start&End\"),0))),SUM(Q331:INDEX(Q331:Q435,MATCH(TRUE,(B331:B435=\"End\"),0)))))","v":""},"",null,null,null,null,null,null,"","","","","","","","",null,"","","","","","","",null,"","","","","","","",null,"","","","","","","",null,"","","","","","",""]
[330,null,null,null,null,null,null,null,null,null,null,null,"","","","","",{"$f":"IF(C332=\"\",\"\",IF(ISNUMBER(SEARCH(\"Start&End\",B332)),SUM(P332:INDEX(P332:P436,MATCH(TRUE,(B332:B436=\"Start&End\"),0))),SUM(P332:INDEX(P332:P436,MATCH(TRUE,(B332:B436=\"End\"),0)))))","v":""},{"$f":"IF(C332=\"\",\"\",IF(ISNUMBER(SEARCH(\"Start&End\",B332)),SUM(Q332:INDEX(Q332:Q436,MATCH(TRUE,(B332:B436=\"Start&End\"),0))),SUM(Q332:INDEX(Q332:Q436,MATCH(TRUE,(B332:B436=\"End\"),0)))))","v":""},"",null,null,null,null,null,null,"","","","","","","","",null,"","","","","","","",null,"","","","","","","",null,"","","","","","","",null,"","","","","","",""]
[331,null,null,null,null,null,null,null,null,null,null,null,"","","","","",{"$f":"IF(C333=\"\",\"\",IF(ISNUMBER(SEARCH(\"Start&End\",B333)),SUM(P333:INDEX(P333:P437,MATCH(TRUE,(B333:B437=\"Start&End\"),0))),SUM(P333:INDEX(P333:P437,MATCH(TRUE,(B333:B437=\"End\"),0)))))","v":""},{"$f":"IF(C333=\"\",\"\",IF(ISNUMBER(SEARCH(\"Start&End\",B333)),SUM(Q333:INDEX(Q333:Q437,MATCH(TRUE,(B333:B437=\"Start&End\"),0))),SUM(Q333:INDEX(Q333:Q437,MATCH(TRUE,(B333:B437=\"End\"),0)))))","v":""},"",null,null,null,null,null,null,"","","","","","","","",null,"","","","","","","",null,"","","","","","","",null,"","","","","","","",null,"","","","","","",""]
[332,null,null,null,null,null,null,null,null,null,null,null,"","","","","",{"$f":"IF(C334=\"\",\"\",IF(ISNUMBER(SEARCH(\"Start&End\",B334)),SUM(P334:INDEX(P334:P438,MATCH(TRUE,(B334:B438=\"Start&End\"),0))),SUM(P334:INDEX(P334:P438,MATCH(TRUE,(B334:B438=\"End\"),0)))))","v":""},{"$f":"IF(C334=\"\",\"\",IF(ISNUMBER(SEARCH(\"Start&End\",B334)),SUM(Q334:INDEX(Q334:Q438,MATCH(TRUE,(B334:B438=\"Start&End\"),0))),SUM(Q334:INDEX(Q334:Q438,MATCH(TRUE,(B334:B438=\"End\"),0)))))","v":""},"",null,null,null,null,null,null,"","","","","","","","",null,"","","","","","","",null,"","","","","","","",null,"","","","","","","",null,"","","","","","",""]
[333,null,null,null,null,null,null,null,null,null,null,null,"","","","","",{"$f":"IF(C335=\"\",\"\",IF(ISNUMBER(SEARCH(\"Start&End\",B335)),SUM(P335:INDEX(P335:P439,MATCH(TRUE,(B335:B439=\"Start&End\"),0))),SUM(P335:INDEX(P335:P439,MATCH(TRUE,(B335:B439=\"End\"),0)))))","v":""},{"$f":"IF(C335=\"\",\"\",IF(ISNUMBER(SEARCH(\"Start&End\",B335)),SUM(Q335:INDEX(Q335:Q439,MATCH(TRUE,(B335:B439=\"Start&End\"),0))),SUM(Q335:INDEX(Q335:Q439,MATCH(TRUE,(B335:B439=\"End\"),0)))))","v":""},"",null,null,null,null,null,null,"","","","","","","","",null,"","","","","","","",null,"","","","","","","",null,"","","","","","","",null,"","","","","","",""]
[334,null,null,null,null,null,null,null,null,null,null,null,"","","","","",{"$f":"IF(C336=\"\",\"\",IF(ISNUMBER(SEARCH(\"Start&End\",B336)),SUM(P336:INDEX(P336:P440,MATCH(TRUE,(B336:B440=\"Start&End\"),0))),SUM(P336:INDEX(P336:P440,MATCH(TRUE,(B336:B440=\"End\"),0)))))","v":""},{"$f":"IF(C336=\"\",\"\",IF(ISNUMBER(SEARCH(\"Start&End\",B336)),SUM(Q336:INDEX(Q336:Q440,MATCH(TRUE,(B336:B440=\"Start&End\"),0))),SUM(Q336:INDEX(Q336:Q440,MATCH(TRUE,(B336:B440=\"End\"),0)))))","v":""},"",null,null,null,null,null,null,"","","","","","","","",null,"","","","","","","",null,"","","","","","","",null,"","","","","","","",null,"","","","","","",""]
[335,null,null,null,null,null,null,null,null,null,null,null,"","","","","",{"$f":"IF(C337=\"\",\"\",IF(ISNUMBER(SEARCH(\"Start&End\",B337)),SUM(P337:INDEX(P337:P441,MATCH(TRUE,(B337:B441=\"Start&End\"),0))),SUM(P337:INDEX(P337:P441,MATCH(TRUE,(B337:B441=\"End\"),0)))))","v":""},{"$f":"IF(C337=\"\",\"\",IF(ISNUMBER(SEARCH(\"Start&End\",B337)),SUM(Q337:INDEX(Q337:Q441,MATCH(TRUE,(B337:B441=\"Start&End\"),0))),SUM(Q337:INDEX(Q337:Q441,MATCH(TRUE,(B337:B441=\"End\"),0)))))","v":""},"",null,null,null,null,null,null,"","","","","","","","",null,"","","","","","","",null,"","","","","","","",null,"","","","","","","",null,"","","","","","",""]
[336,null,null,null,null,null,null,null,null,null,null,null,"","","","","",{"$f":"IF(C338=\"\",\"\",IF(ISNUMBER(SEARCH(\"Start&End\",B338)),SUM(P338:INDEX(P338:P442,MATCH(TRUE,(B338:B442=\"Start&End\"),0))),SUM(P338:INDEX(P338:P442,MATCH(TRUE,(B338:B442=\"End\"),0)))))","v":""},{"$f":"IF(C338=\"\",\"\",IF(ISNUMBER(SEARCH(\"Start&End\",B338)),SUM(Q338:INDEX(Q338:Q442,MATCH(TRUE,(B338:B442=\"Start&End\"),0))),SUM(Q338:INDEX(Q338:Q442,MATCH(TRUE,(B338:B442=\"End\"),0)))))","v":""},"",null,null,null,null,null,null,"","","","","","","","",null,"","","","","","","",null,"","","","","","","",null,"","","","","","","",null,"","","","","","",""]
[337,null,null,null,null,null,null,null,null,null,null,null,"","","","","",{"$f":"IF(C339=\"\",\"\",IF(ISNUMBER(SEARCH(\"Start&End\",B339)),SUM(P339:INDEX(P339:P443,MATCH(TRUE,(B339:B443=\"Start&End\"),0))),SUM(P339:INDEX(P339:P443,MATCH(TRUE,(B339:B443=\"End\"),0)))))","v":""},{"$f":"IF(C339=\"\",\"\",IF(ISNUMBER(SEARCH(\"Start&End\",B339)),SUM(Q339:INDEX(Q339:Q443,MATCH(TRUE,(B339:B443=\"Start&End\"),0))),SUM(Q339:INDEX(Q339:Q443,MATCH(TRUE,(B339:B443=\"End\"),0)))))","v":""},"",null,null,null,null,null,null,"","","","","","","","",null,"","","","","","","",null,"","","","","","","",null,"","","","","","","",null,"","","","","","",""]
[338,null,null,null,null,null,null,null,null,null,null,null,"","","","","",{"$f":"IF(C340=\"\",\"\",IF(ISNUMBER(SEARCH(\"Start&End\",B340)),SUM(P340:INDEX(P340:P444,MATCH(TRUE,(B340:B444=\"Start&End\"),0))),SUM(P340:INDEX(P340:P444,MATCH(TRUE,(B340:B444=\"End\"),0)))))","v":""},{"$f":"IF(C340=\"\",\"\",IF(ISNUMBER(SEARCH(\"Start&End\",B340)),SUM(Q340:INDEX(Q340:Q444,MATCH(TRUE,(B340:B444=\"Start&End\"),0))),SUM(Q340:INDEX(Q340:Q444,MATCH(TRUE,(B340:B444=\"End\"),0)))))","v":""},"",null,null,null,null,null,null,"","","","","","","","",null,"","","","","","","",null,"","","","","","","",null,"","","","","","","",null,"","","","","","",""]
[339,null,null,null,null,null,null,null,null,null,null,null,"","","","","",{"$f":"IF(C341=\"\",\"\",IF(ISNUMBER(SEARCH(\"Start&End\",B341)),SUM(P341:INDEX(P341:P445,MATCH(TRUE,(B341:B445=\"Start&End\"),0))),SUM(P341:INDEX(P341:P445,MATCH(TRUE,(B341:B445=\"End\"),0)))))","v":""},{"$f":"IF(C341=\"\",\"\",IF(ISNUMBER(SEARCH(\"Start&End\",B341)),SUM(Q341:INDEX(Q341:Q445,MATCH(TRUE,(B341:B445=\"Start&End\"),0))),SUM(Q341:INDEX(Q341:Q445,MATCH(TRUE,(B341:B445=\"End\"),0)))))","v":""},"",null,null,null,null,null,null,"","","","","","","","",null,"","","","","","","",null,"","","","","","","",null,"","","","","","","",null,"","","","","","",""]
[340,null,null,null,null,null,null,null,null,null,null,null,"","","","","",{"$f":"IF(C342=\"\",\"\",IF(ISNUMBER(SEARCH(\"Start&End\",B342)),SUM(P342:INDEX(P342:P446,MATCH(TRUE,(B342:B446=\"Start&End\"),0))),SUM(P342:INDEX(P342:P446,MATCH(TRUE,(B342:B446=\"End\"),0)))))","v":""},{"$f":"IF(C342=\"\",\"\",IF(ISNUMBER(SEARCH(\"Start&End\",B342)),SUM(Q342:INDEX(Q342:Q446,MATCH(TRUE,(B342:B446=\"Start&End\"),0))),SUM(Q342:INDEX(Q342:Q446,MATCH(TRUE,(B342:B446=\"End\"),0)))))","v":""},"",null,null,null,null,null,null,"","","","","","","","",null,"","","","","","","",null,"","","","","","","",null,"","","","","","","",null,"","","","","","",""]
[341,null,null,null,null,null,null,null,null,null,null,null,"","","","","",{"$f":"IF(C343=\"\",\"\",IF(ISNUMBER(SEARCH(\"Start&End\",B343)),SUM(P343:INDEX(P343:P447,MATCH(TRUE,(B343:B447=\"Start&End\"),0))),SUM(P343:INDEX(P343:P447,MATCH(TRUE,(B343:B447=\"End\"),0)))))","v":""},{"$f":"IF(C343=\"\",\"\",IF(ISNUMBER(SEARCH(\"Start&End\",B343)),SUM(Q343:INDEX(Q343:Q447,MATCH(TRUE,(B343:B447=\"Start&End\"),0))),SUM(Q343:INDEX(Q343:Q447,MATCH(TRUE,(B343:B447=\"End\"),0)))))","v":""},"",null,null,null,null,null,null,"","","","","","","","",null,"","","","","","","",null,"","","","","","","",null,"","","","","","","",null,"","","","","","",""]
[342,null,null,null,null,null,null,null,null,null,null,null,"","","","","",{"$f":"IF(C344=\"\",\"\",IF(ISNUMBER(SEARCH(\"Start&End\",B344)),SUM(P344:INDEX(P344:P448,MATCH(TRUE,(B344:B448=\"Start&End\"),0))),SUM(P344:INDEX(P344:P448,MATCH(TRUE,(B344:B448=\"End\"),0)))))","v":""},{"$f":"IF(C344=\"\",\"\",IF(ISNUMBER(SEARCH(\"Start&End\",B344)),SUM(Q344:INDEX(Q344:Q448,MATCH(TRUE,(B344:B448=\"Start&End\"),0))),SUM(Q344:INDEX(Q344:Q448,MATCH(TRUE,(B344:B448=\"End\"),0)))))","v":""},"",null,null,null,null,null,null,"","","","","","","","",null,"","","","","","","",null,"","","","","","","",null,"","","","","","","",null,"","","","","","",""]
[343,null,null,null,null,null,null,null,null,null,null,null,"","","","","",{"$f":"IF(C345=\"\",\"\",IF(ISNUMBER(SEARCH(\"Start&End\",B345)),SUM(P345:INDEX(P345:P449,MATCH(TRUE,(B345:B449=\"Start&End\"),0))),SUM(P345:INDEX(P345:P449,MATCH(TRUE,(B345:B449=\"End\"),0)))))","v":""},{"$f":"IF(C345=\"\",\"\",IF(ISNUMBER(SEARCH(\"Start&End\",B345)),SUM(Q345:INDEX(Q345:Q449,MATCH(TRUE,(B345:B449=\"Start&End\"),0))),SUM(Q345:INDEX(Q345:Q449,MATCH(TRUE,(B345:B449=\"End\"),0)))))","v":""},"",null,null,null,null,null,null,"","","","","","","","",null,"","","","","","","",null,"","","","","","","",null,"","","","","","","",null,"","","","","","",""]
[344,null,null,null,null,null,null,null,null,null,null,null,"","","","","",{"$f":"IF(C346=\"\",\"\",IF(ISNUMBER(SEARCH(\"Start&End\",B346)),SUM(P346:INDEX(P346:P450,MATCH(TRUE,(B346:B450=\"Start&End\"),0))),SUM(P346:INDEX(P346:P450,MATCH(TRUE,(B346:B450=\"End\"),0)))))","v":""},{"$f":"IF(C346=\"\",\"\",IF(ISNUMBER(SEARCH(\"Start&End\",B346)),SUM(Q346:INDEX(Q346:Q450,MATCH(TRUE,(B346:B450=\"Start&End\"),0))),SUM(Q346:INDEX(Q346:Q450,MATCH(TRUE,(B346:B450=\"End\"),0)))))","v":""},"",null,null,null,null,null,null,"","","","","","","","",null,"","","","","","","",null,"","","","","","","",null,"","","","","","","",null,"","","","","","",""]
[345,null,null,null,null,null,null,null,null,null,null,null,"","","","","",{"$f":"IF(C347=\"\",\"\",IF(ISNUMBER(SEARCH(\"Start&End\",B347)),SUM(P347:INDEX(P347:P451,MATCH(TRUE,(B347:B451=\"Start&End\"),0))),SUM(P347:INDEX(P347:P451,MATCH(TRUE,(B347:B451=\"End\"),0)))))","v":""},{"$f":"IF(C347=\"\",\"\",IF(ISNUMBER(SEARCH(\"Start&End\",B347)),SUM(Q347:INDEX(Q347:Q451,MATCH(TRUE,(B347:B451=\"Start&End\"),0))),SUM(Q347:INDEX(Q347:Q451,MATCH(TRUE,(B347:B451=\"End\"),0)))))","v":""},"",null,null,null,null,null,null,"","","","","","","","",null,"","","","","","","",null,"","","","","","","",null,"","","","","","","",null,"","","","","","",""]
[346,null,null,null,null,null,null,null,null,null,null,null,"","","","","",{"$f":"IF(C348=\"\",\"\",IF(ISNUMBER(SEARCH(\"Start&End\",B348)),SUM(P348:INDEX(P348:P452,MATCH(TRUE,(B348:B452=\"Start&End\"),0))),SUM(P348:INDEX(P348:P452,MATCH(TRUE,(B348:B452=\"End\"),0)))))","v":""},{"$f":"IF(C348=\"\",\"\",IF(ISNUMBER(SEARCH(\"Start&End\",B348)),SUM(Q348:INDEX(Q348:Q452,MATCH(TRUE,(B348:B452=\"Start&End\"),0))),SUM(Q348:INDEX(Q348:Q452,MATCH(TRUE,(B348:B452=\"End\"),0)))))","v":""},"",null,null,null,null,null,null,"","","","","","","","",null,"","","","","","","",null,"","","","","","","",null,"","","","","","","",null,"","","","","","",""]
[347,null,null,null,null,null,null,null,null,null,null,null,"","","","","",{"$f":"IF(C349=\"\",\"\",IF(ISNUMBER(SEARCH(\"Start&End\",B349)),SUM(P349:INDEX(P349:P453,MATCH(TRUE,(B349:B453=\"Start&End\"),0))),SUM(P349:INDEX(P349:P453,MATCH(TRUE,(B349:B453=\"End\"),0)))))","v":""},{"$f":"IF(C349=\"\",\"\",IF(ISNUMBER(SEARCH(\"Start&End\",B349)),SUM(Q349:INDEX(Q349:Q453,MATCH(TRUE,(B349:B453=\"Start&End\"),0))),SUM(Q349:INDEX(Q349:Q453,MATCH(TRUE,(B349:B453=\"End\"),0)))))","v":""},"",null,null,null,null,null,null,"","","","","","","","",null,"","","","","","","",null,"","","","","","","",null,"","","","","","","",null,"","","","","","",""]
[348,null,null,null,null,null,null,null,null,null,null,null,"","","","","",{"$f":"IF(C350=\"\",\"\",IF(ISNUMBER(SEARCH(\"Start&End\",B350)),SUM(P350:INDEX(P350:P454,MATCH(TRUE,(B350:B454=\"Start&End\"),0))),SUM(P350:INDEX(P350:P454,MATCH(TRUE,(B350:B454=\"End\"),0)))))","v":""},{"$f":"IF(C350=\"\",\"\",IF(ISNUMBER(SEARCH(\"Start&End\",B350)),SUM(Q350:INDEX(Q350:Q454,MATCH(TRUE,(B350:B454=\"Start&End\"),0))),SUM(Q350:INDEX(Q350:Q454,MATCH(TRUE,(B350:B454=\"End\"),0)))))","v":""},"",null,null,null,null,null,null,"","","","","","","","",null,"","","","","","","",null,"","","","","","","",null,"","","","","","","",null,"","","","","","",""]
[349,null,null,null,null,null,null,null,null,null,null,null,"","","","","",{"$f":"IF(C351=\"\",\"\",IF(ISNUMBER(SEARCH(\"Start&End\",B351)),SUM(P351:INDEX(P351:P455,MATCH(TRUE,(B351:B455=\"Start&End\"),0))),SUM(P351:INDEX(P351:P455,MATCH(TRUE,(B351:B455=\"End\"),0)))))","v":""},{"$f":"IF(C351=\"\",\"\",IF(ISNUMBER(SEARCH(\"Start&End\",B351)),SUM(Q351:INDEX(Q351:Q455,MATCH(TRUE,(B351:B455=\"Start&End\"),0))),SUM(Q351:INDEX(Q351:Q455,MATCH(TRUE,(B351:B455=\"End\"),0)))))","v":""},"",null,null,null,null,null,null,"","","","","","","","",null,"","","","","","","",null,"","","","","","","",null,"","","","","","","",null,"","","","","","",""]
[350,null,null,null,null,null,null,null,null,null,null,null,"","","","","",{"$f":"IF(C352=\"\",\"\",IF(ISNUMBER(SEARCH(\"Start&End\",B352)),SUM(P352:INDEX(P352:P456,MATCH(TRUE,(B352:B456=\"Start&End\"),0))),SUM(P352:INDEX(P352:P456,MATCH(TRUE,(B352:B456=\"End\"),0)))))","v":""},{"$f":"IF(C352=\"\",\"\",IF(ISNUMBER(SEARCH(\"Start&End\",B352)),SUM(Q352:INDEX(Q352:Q456,MATCH(TRUE,(B352:B456=\"Start&End\"),0))),SUM(Q352:INDEX(Q352:Q456,MATCH(TRUE,(B352:B456=\"End\"),0)))))","v":""},"",null,null,null,null,null,null,"","","","","","","","",null,"","","","","","","",null,"","","","","","","",null,"","","","","","","",null,"","","","","","",""]
[351,null,null,null,null,null,null,null,null,null,null,null,"","","","","",{"$f":"IF(C353=\"\",\"\",IF(ISNUMBER(SEARCH(\"Start&End\",B353)),SUM(P353:INDEX(P353:P457,MATCH(TRUE,(B353:B457=\"Start&End\"),0))),SUM(P353:INDEX(P353:P457,MATCH(TRUE,(B353:B457=\"End\"),0)))))","v":""},{"$f":"IF(C353=\"\",\"\",IF(ISNUMBER(SEARCH(\"Start&End\",B353)),SUM(Q353:INDEX(Q353:Q457,MATCH(TRUE,(B353:B457=\"Start&End\"),0))),SUM(Q353:INDEX(Q353:Q457,MATCH(TRUE,(B353:B457=\"End\"),0)))))","v":""},"",null,null,null,null,null,null,"","","","","","","","",null,"","","","","","","",null,"","","","","","","",null,"","","","","","","",null,"","","","","","",""]
[352,null,null,null,null,null,null,null,null,null,null,null,"","","","","",{"$f":"IF(C354=\"\",\"\",IF(ISNUMBER(SEARCH(\"Start&End\",B354)),SUM(P354:INDEX(P354:P458,MATCH(TRUE,(B354:B458=\"Start&End\"),0))),SUM(P354:INDEX(P354:P458,MATCH(TRUE,(B354:B458=\"End\"),0)))))","v":""},{"$f":"IF(C354=\"\",\"\",IF(ISNUMBER(SEARCH(\"Start&End\",B354)),SUM(Q354:INDEX(Q354:Q458,MATCH(TRUE,(B354:B458=\"Start&End\"),0))),SUM(Q354:INDEX(Q354:Q458,MATCH(TRUE,(B354:B458=\"End\"),0)))))","v":""},"",null,null,null,null,null,null,"","","","","","","","",null,"","","","","","","",null,"","","","","","","",null,"","","","","","","",null,"","","","","","",""]
[353,null,null,null,null,null,null,null,null,null,null,null,"","","","","",{"$f":"IF(C355=\"\",\"\",IF(ISNUMBER(SEARCH(\"Start&End\",B355)),SUM(P355:INDEX(P355:P459,MATCH(TRUE,(B355:B459=\"Start&End\"),0))),SUM(P355:INDEX(P355:P459,MATCH(TRUE,(B355:B459=\"End\"),0)))))","v":""},{"$f":"IF(C355=\"\",\"\",IF(ISNUMBER(SEARCH(\"Start&End\",B355)),SUM(Q355:INDEX(Q355:Q459,MATCH(TRUE,(B355:B459=\"Start&End\"),0))),SUM(Q355:INDEX(Q355:Q459,MATCH(TRUE,(B355:B459=\"End\"),0)))))","v":""},"",null,null,null,null,null,null,"","","","","","","","",null,"","","","","","","",null,"","","","","","","",null,"","","","","","","",null,"","","","","","",""]
[354,null,null,null,null,null,null,null,null,null,null,null,"","","","","",{"$f":"IF(C356=\"\",\"\",IF(ISNUMBER(SEARCH(\"Start&End\",B356)),SUM(P356:INDEX(P356:P460,MATCH(TRUE,(B356:B460=\"Start&End\"),0))),SUM(P356:INDEX(P356:P460,MATCH(TRUE,(B356:B460=\"End\"),0)))))","v":""},{"$f":"IF(C356=\"\",\"\",IF(ISNUMBER(SEARCH(\"Start&End\",B356)),SUM(Q356:INDEX(Q356:Q460,MATCH(TRUE,(B356:B460=\"Start&End\"),0))),SUM(Q356:INDEX(Q356:Q460,MATCH(TRUE,(B356:B460=\"End\"),0)))))","v":""},"",null,null,null,null,null,null,"","","","","","","","",null,"","","","","","","",null,"","","","","","","",null,"","","","","","","",null,"","","","","","",""]
[355,null,null,null,null,null,null,null,null,null,null,null,"","","","","",{"$f":"IF(C357=\"\",\"\",IF(ISNUMBER(SEARCH(\"Start&End\",B357)),SUM(P357:INDEX(P357:P461,MATCH(TRUE,(B357:B461=\"Start&End\"),0))),SUM(P357:INDEX(P357:P461,MATCH(TRUE,(B357:B461=\"End\"),0)))))","v":""},{"$f":"IF(C357=\"\",\"\",IF(ISNUMBER(SEARCH(\"Start&End\",B357)),SUM(Q357:INDEX(Q357:Q461,MATCH(TRUE,(B357:B461=\"Start&End\"),0))),SUM(Q357:INDEX(Q357:Q461,MATCH(TRUE,(B357:B461=\"End\"),0)))))","v":""},"",null,null,null,null,null,null,"","","","","","","","",null,"","","","","","","",null,"","","","","","","",null,"","","","","","","",null,"","","","","","",""]
[356,null,null,null,null,null,null,null,null,null,null,null,"","","","","",{"$f":"IF(C358=\"\",\"\",IF(ISNUMBER(SEARCH(\"Start&End\",B358)),SUM(P358:INDEX(P358:P462,MATCH(TRUE,(B358:B462=\"Start&End\"),0))),SUM(P358:INDEX(P358:P462,MATCH(TRUE,(B358:B462=\"End\"),0)))))","v":""},{"$f":"IF(C358=\"\",\"\",IF(ISNUMBER(SEARCH(\"Start&End\",B358)),SUM(Q358:INDEX(Q358:Q462,MATCH(TRUE,(B358:B462=\"Start&End\"),0))),SUM(Q358:INDEX(Q358:Q462,MATCH(TRUE,(B358:B462=\"End\"),0)))))","v":""},"",null,null,null,null,null,null,"","","","","","","","",null,"","","","","","","",null,"","","","","","","",null,"","","","","","","",null,"","","","","","",""]
[357,null,null,null,null,null,null,null,null,null,null,null,"","","","","",{"$f":"IF(C359=\"\",\"\",IF(ISNUMBER(SEARCH(\"Start&End\",B359)),SUM(P359:INDEX(P359:P463,MATCH(TRUE,(B359:B463=\"Start&End\"),0))),SUM(P359:INDEX(P359:P463,MATCH(TRUE,(B359:B463=\"End\"),0)))))","v":""},{"$f":"IF(C359=\"\",\"\",IF(ISNUMBER(SEARCH(\"Start&End\",B359)),SUM(Q359:INDEX(Q359:Q463,MATCH(TRUE,(B359:B463=\"Start&End\"),0))),SUM(Q359:INDEX(Q359:Q463,MATCH(TRUE,(B359:B463=\"End\"),0)))))","v":""},"",null,null,null,null,null,null,"","","","","","","","",null,"","","","","","","",null,"","","","","","","",null,"","","","","","","",null,"","","","","","",""]
[358,null,null,null,null,null,null,null,null,null,null,null,"","","","","",{"$f":"IF(C360=\"\",\"\",IF(ISNUMBER(SEARCH(\"Start&End\",B360)),SUM(P360:INDEX(P360:P464,MATCH(TRUE,(B360:B464=\"Start&End\"),0))),SUM(P360:INDEX(P360:P464,MATCH(TRUE,(B360:B464=\"End\"),0)))))","v":""},{"$f":"IF(C360=\"\",\"\",IF(ISNUMBER(SEARCH(\"Start&End\",B360)),SUM(Q360:INDEX(Q360:Q464,MATCH(TRUE,(B360:B464=\"Start&End\"),0))),SUM(Q360:INDEX(Q360:Q464,MATCH(TRUE,(B360:B464=\"End\"),0)))))","v":""},"",null,null,null,null,null,null,"","","","","","","","",null,"","","","","","","",null,"","","","","","","",null,"","","","","","","",null,"","","","","","",""]
[359,null,null,null,null,null,null,null,null,null,null,null,"","","","","",{"$f":"IF(C361=\"\",\"\",IF(ISNUMBER(SEARCH(\"Start&End\",B361)),SUM(P361:INDEX(P361:P465,MATCH(TRUE,(B361:B465=\"Start&End\"),0))),SUM(P361:INDEX(P361:P465,MATCH(TRUE,(B361:B465=\"End\"),0)))))","v":""},{"$f":"IF(C361=\"\",\"\",IF(ISNUMBER(SEARCH(\"Start&End\",B361)),SUM(Q361:INDEX(Q361:Q465,MATCH(TRUE,(B361:B465=\"Start&End\"),0))),SUM(Q361:INDEX(Q361:Q465,MATCH(TRUE,(B361:B465=\"End\"),0)))))","v":""},"",null,null,null,null,null,null,"","","","","","","","",null,"","","","","","","",null,"","","","","","","",null,"","","","","","","",null,"","","","","","",""]
[360,null,null,null,null,null,null,null,null,null,null,null,"","","","","",{"$f":"IF(C362=\"\",\"\",IF(ISNUMBER(SEARCH(\"Start&End\",B362)),SUM(P362:INDEX(P362:P466,MATCH(TRUE,(B362:B466=\"Start&End\"),0))),SUM(P362:INDEX(P362:P466,MATCH(TRUE,(B362:B466=\"End\"),0)))))","v":""},{"$f":"IF(C362=\"\",\"\",IF(ISNUMBER(SEARCH(\"Start&End\",B362)),SUM(Q362:INDEX(Q362:Q466,MATCH(TRUE,(B362:B466=\"Start&End\"),0))),SUM(Q362:INDEX(Q362:Q466,MATCH(TRUE,(B362:B466=\"End\"),0)))))","v":""},"",null,null,null,null,null,null,"","","","","","","","",null,"","","","","","","",null,"","","","","","","",null,"","","","","","","",null,"","","","","","",""]
[361,null,null,null,null,null,null,null,null,null,null,null,"","","","","",{"$f":"IF(C363=\"\",\"\",IF(ISNUMBER(SEARCH(\"Start&End\",B363)),SUM(P363:INDEX(P363:P467,MATCH(TRUE,(B363:B467=\"Start&End\"),0))),SUM(P363:INDEX(P363:P467,MATCH(TRUE,(B363:B467=\"End\"),0)))))","v":""},{"$f":"IF(C363=\"\",\"\",IF(ISNUMBER(SEARCH(\"Start&End\",B363)),SUM(Q363:INDEX(Q363:Q467,MATCH(TRUE,(B363:B467=\"Start&End\"),0))),SUM(Q363:INDEX(Q363:Q467,MATCH(TRUE,(B363:B467=\"End\"),0)))))","v":""},"",null,null,null,null,null,null,"","","","","","","","",null,"","","","","","","",null,"","","","","","","",null,"","","","","","","",null,"","","","","","",""]
[362,null,null,null,null,null,null,null,null,null,null,null,"","","","","",{"$f":"IF(C364=\"\",\"\",IF(ISNUMBER(SEARCH(\"Start&End\",B364)),SUM(P364:INDEX(P364:P468,MATCH(TRUE,(B364:B468=\"Start&End\"),0))),SUM(P364:INDEX(P364:P468,MATCH(TRUE,(B364:B468=\"End\"),0)))))","v":""},{"$f":"IF(C364=\"\",\"\",IF(ISNUMBER(SEARCH(\"Start&End\",B364)),SUM(Q364:INDEX(Q364:Q468,MATCH(TRUE,(B364:B468=\"Start&End\"),0))),SUM(Q364:INDEX(Q364:Q468,MATCH(TRUE,(B364:B468=\"End\"),0)))))","v":""},"",null,null,null,null,null,null,"","","","","","","","",null,"","","","","","","",null,"","","","","","","",null,"","","","","","","",null,"","","","","","",""]
[363,null,null,null,null,null,null,null,null,null,null,null,"","","","","",{"$f":"IF(C365=\"\",\"\",IF(ISNUMBER(SEARCH(\"Start&End\",B365)),SUM(P365:INDEX(P365:P469,MATCH(TRUE,(B365:B469=\"Start&End\"),0))),SUM(P365:INDEX(P365:P469,MATCH(TRUE,(B365:B469=\"End\"),0)))))","v":""},{"$f":"IF(C365=\"\",\"\",IF(ISNUMBER(SEARCH(\"Start&End\",B365)),SUM(Q365:INDEX(Q365:Q469,MATCH(TRUE,(B365:B469=\"Start&End\"),0))),SUM(Q365:INDEX(Q365:Q469,MATCH(TRUE,(B365:B469=\"End\"),0)))))","v":""},"",null,null,null,null,null,null,"","","","","","","","",null,"","","","","","","",null,"","","","","","","",null,"","","","","","","",null,"","","","","","",""]
[364,null,null,null,null,null,null,null,null,null,null,null,"","","","","",{"$f":"IF(C366=\"\",\"\",IF(ISNUMBER(SEARCH(\"Start&End\",B366)),SUM(P366:INDEX(P366:P470,MATCH(TRUE,(B366:B470=\"Start&End\"),0))),SUM(P366:INDEX(P366:P470,MATCH(TRUE,(B366:B470=\"End\"),0)))))","v":""},{"$f":"IF(C366=\"\",\"\",IF(ISNUMBER(SEARCH(\"Start&End\",B366)),SUM(Q366:INDEX(Q366:Q470,MATCH(TRUE,(B366:B470=\"Start&End\"),0))),SUM(Q366:INDEX(Q366:Q470,MATCH(TRUE,(B366:B470=\"End\"),0)))))","v":""},"",null,null,null,null,null,null,"","","","","","","","",null,"","","","","","","",null,"","","","","","","",null,"","","","","","","",null,"","","","","","",""]
[365,null,null,null,null,null,null,null,null,null,null,null,"","","","","",{"$f":"IF(C367=\"\",\"\",IF(ISNUMBER(SEARCH(\"Start&End\",B367)),SUM(P367:INDEX(P367:P471,MATCH(TRUE,(B367:B471=\"Start&End\"),0))),SUM(P367:INDEX(P367:P471,MATCH(TRUE,(B367:B471=\"End\"),0)))))","v":""},{"$f":"IF(C367=\"\",\"\",IF(ISNUMBER(SEARCH(\"Start&End\",B367)),SUM(Q367:INDEX(Q367:Q471,MATCH(TRUE,(B367:B471=\"Start&End\"),0))),SUM(Q367:INDEX(Q367:Q471,MATCH(TRUE,(B367:B471=\"End\"),0)))))","v":""},"",null,null,null,null,null,null,"","","","","","","","",null,"","","","","","","",null,"","","","","","","",null,"","","","","","","",null,"","","","","","",""]
[366,null,null,null,null,null,null,null,null,null,null,null,"","","","","",{"$f":"IF(C368=\"\",\"\",IF(ISNUMBER(SEARCH(\"Start&End\",B368)),SUM(P368:INDEX(P368:P472,MATCH(TRUE,(B368:B472=\"Start&End\"),0))),SUM(P368:INDEX(P368:P472,MATCH(TRUE,(B368:B472=\"End\"),0)))))","v":""},{"$f":"IF(C368=\"\",\"\",IF(ISNUMBER(SEARCH(\"Start&End\",B368)),SUM(Q368:INDEX(Q368:Q472,MATCH(TRUE,(B368:B472=\"Start&End\"),0))),SUM(Q368:INDEX(Q368:Q472,MATCH(TRUE,(B368:B472=\"End\"),0)))))","v":""},"",null,null,null,null,null,null,"","","","","","","","",null,"","","","","","","",null,"","","","","","","",null,"","","","","","","",null,"","","","","","",""]
[367,null,null,null,null,null,null,null,null,null,null,null,"","","","","",{"$f":"IF(C369=\"\",\"\",IF(ISNUMBER(SEARCH(\"Start&End\",B369)),SUM(P369:INDEX(P369:P473,MATCH(TRUE,(B369:B473=\"Start&End\"),0))),SUM(P369:INDEX(P369:P473,MATCH(TRUE,(B369:B473=\"End\"),0)))))","v":""},{"$f":"IF(C369=\"\",\"\",IF(ISNUMBER(SEARCH(\"Start&End\",B369)),SUM(Q369:INDEX(Q369:Q473,MATCH(TRUE,(B369:B473=\"Start&End\"),0))),SUM(Q369:INDEX(Q369:Q473,MATCH(TRUE,(B369:B473=\"End\"),0)))))","v":""},"",null,null,null,null,null,null,"","","","","","","","",null,"","","","","","","",null,"","","","","","","",null,"","","","","","","",null,"","","","","","",""]
[368,null,null,null,null,null,null,null,null,null,null,null,"","","","","",{"$f":"IF(C370=\"\",\"\",IF(ISNUMBER(SEARCH(\"Start&End\",B370)),SUM(P370:INDEX(P370:P474,MATCH(TRUE,(B370:B474=\"Start&End\"),0))),SUM(P370:INDEX(P370:P474,MATCH(TRUE,(B370:B474=\"End\"),0)))))","v":""},{"$f":"IF(C370=\"\",\"\",IF(ISNUMBER(SEARCH(\"Start&End\",B370)),SUM(Q370:INDEX(Q370:Q474,MATCH(TRUE,(B370:B474=\"Start&End\"),0))),SUM(Q370:INDEX(Q370:Q474,MATCH(TRUE,(B370:B474=\"End\"),0)))))","v":""},"",null,null,null,null,null,null,"","","","","","","","",null,"","","","","","","",null,"","","","","","","",null,"","","","","","","",null,"","","","","","",""]
[369,null,null,null,null,null,null,null,null,null,null,null,"","","","","",{"$f":"IF(C371=\"\",\"\",IF(ISNUMBER(SEARCH(\"Start&End\",B371)),SUM(P371:INDEX(P371:P475,MATCH(TRUE,(B371:B475=\"Start&End\"),0))),SUM(P371:INDEX(P371:P475,MATCH(TRUE,(B371:B475=\"End\"),0)))))","v":""},{"$f":"IF(C371=\"\",\"\",IF(ISNUMBER(SEARCH(\"Start&End\",B371)),SUM(Q371:INDEX(Q371:Q475,MATCH(TRUE,(B371:B475=\"Start&End\"),0))),SUM(Q371:INDEX(Q371:Q475,MATCH(TRUE,(B371:B475=\"End\"),0)))))","v":""},"",null,null,null,null,null,null,"","","","","","","","",null,"","","","","","","",null,"","","","","","","",null,"","","","","","","",null,"","","","","","",""]
[370,null,null,null,null,null,null,null,null,null,null,null,"","","","","",{"$f":"IF(C372=\"\",\"\",IF(ISNUMBER(SEARCH(\"Start&End\",B372)),SUM(P372:INDEX(P372:P476,MATCH(TRUE,(B372:B476=\"Start&End\"),0))),SUM(P372:INDEX(P372:P476,MATCH(TRUE,(B372:B476=\"End\"),0)))))","v":""},{"$f":"IF(C372=\"\",\"\",IF(ISNUMBER(SEARCH(\"Start&End\",B372)),SUM(Q372:INDEX(Q372:Q476,MATCH(TRUE,(B372:B476=\"Start&End\"),0))),SUM(Q372:INDEX(Q372:Q476,MATCH(TRUE,(B372:B476=\"End\"),0)))))","v":""},"",null,null,null,null,null,null,"","","","","","","","",null,"","","","","","","",null,"","","","","","","",null,"","","","","","","",null,"","","","","","",""]
[371,null,null,null,null,null,null,null,null,null,null,null,"","","","","",{"$f":"IF(C373=\"\",\"\",IF(ISNUMBER(SEARCH(\"Start&End\",B373)),SUM(P373:INDEX(P373:P477,MATCH(TRUE,(B373:B477=\"Start&End\"),0))),SUM(P373:INDEX(P373:P477,MATCH(TRUE,(B373:B477=\"End\"),0)))))","v":""},{"$f":"IF(C373=\"\",\"\",IF(ISNUMBER(SEARCH(\"Start&End\",B373)),SUM(Q373:INDEX(Q373:Q477,MATCH(TRUE,(B373:B477=\"Start&End\"),0))),SUM(Q373:INDEX(Q373:Q477,MATCH(TRUE,(B373:B477=\"End\"),0)))))","v":""},"",null,null,null,null,null,null,"","","","","","","","",null,"","","","","","","",null,"","","","","","","",null,"","","","","","","",null,"","","","","","",""]
[372,null,null,null,null,null,null,null,null,null,null,null,"","","","","",{"$f":"IF(C374=\"\",\"\",IF(ISNUMBER(SEARCH(\"Start&End\",B374)),SUM(P374:INDEX(P374:P478,MATCH(TRUE,(B374:B478=\"Start&End\"),0))),SUM(P374:INDEX(P374:P478,MATCH(TRUE,(B374:B478=\"End\"),0)))))","v":""},{"$f":"IF(C374=\"\",\"\",IF(ISNUMBER(SEARCH(\"Start&End\",B374)),SUM(Q374:INDEX(Q374:Q478,MATCH(TRUE,(B374:B478=\"Start&End\"),0))),SUM(Q374:INDEX(Q374:Q478,MATCH(TRUE,(B374:B478=\"End\"),0)))))","v":""},"",null,null,null,null,null,null,"","","","","","","","",null,"","","","","","","",null,"","","","","","","",null,"","","","","","","",null,"","","","","","",""]
[373,null,null,null,null,null,null,null,null,null,null,null,"","","","","",{"$f":"IF(C375=\"\",\"\",IF(ISNUMBER(SEARCH(\"Start&End\",B375)),SUM(P375:INDEX(P375:P479,MATCH(TRUE,(B375:B479=\"Start&End\"),0))),SUM(P375:INDEX(P375:P479,MATCH(TRUE,(B375:B479=\"End\"),0)))))","v":""},{"$f":"IF(C375=\"\",\"\",IF(ISNUMBER(SEARCH(\"Start&End\",B375)),SUM(Q375:INDEX(Q375:Q479,MATCH(TRUE,(B375:B479=\"Start&End\"),0))),SUM(Q375:INDEX(Q375:Q479,MATCH(TRUE,(B375:B479=\"End\"),0)))))","v":""},"",null,null,null,null,null,null,"","","","","","","","",null,"","","","","","","",null,"","","","","","","",null,"","","","","","","",null,"","","","","","",""]
[374,null,null,null,null,null,null,null,null,null,null,null,"","","","","",{"$f":"IF(C376=\"\",\"\",IF(ISNUMBER(SEARCH(\"Start&End\",B376)),SUM(P376:INDEX(P376:P480,MATCH(TRUE,(B376:B480=\"Start&End\"),0))),SUM(P376:INDEX(P376:P480,MATCH(TRUE,(B376:B480=\"End\"),0)))))","v":""},{"$f":"IF(C376=\"\",\"\",IF(ISNUMBER(SEARCH(\"Start&End\",B376)),SUM(Q376:INDEX(Q376:Q480,MATCH(TRUE,(B376:B480=\"Start&End\"),0))),SUM(Q376:INDEX(Q376:Q480,MATCH(TRUE,(B376:B480=\"End\"),0)))))","v":""},"",null,null,null,null,null,null,"","","","","","","","",null,"","","","","","","",null,"","","","","","","",null,"","","","","","","",null,"","","","","","",""]
[375,null,null,null,null,null,null,null,null,null,null,null,"","","","","",{"$f":"IF(C377=\"\",\"\",IF(ISNUMBER(SEARCH(\"Start&End\",B377)),SUM(P377:INDEX(P377:P481,MATCH(TRUE,(B377:B481=\"Start&End\"),0))),SUM(P377:INDEX(P377:P481,MATCH(TRUE,(B377:B481=\"End\"),0)))))","v":""},{"$f":"IF(C377=\"\",\"\",IF(ISNUMBER(SEARCH(\"Start&End\",B377)),SUM(Q377:INDEX(Q377:Q481,MATCH(TRUE,(B377:B481=\"Start&End\"),0))),SUM(Q377:INDEX(Q377:Q481,MATCH(TRUE,(B377:B481=\"End\"),0)))))","v":""},"",null,null,null,null,null,null,"","","","","","","","",null,"","","","","","","",null,"","","","","","","",null,"","","","","","","",null,"","","","","","",""]
[376,null,null,null,null,null,null,null,null,null,null,null,"","","","","",{"$f":"IF(C378=\"\",\"\",IF(ISNUMBER(SEARCH(\"Start&End\",B378)),SUM(P378:INDEX(P378:P482,MATCH(TRUE,(B378:B482=\"Start&End\"),0))),SUM(P378:INDEX(P378:P482,MATCH(TRUE,(B378:B482=\"End\"),0)))))","v":""},{"$f":"IF(C378=\"\",\"\",IF(ISNUMBER(SEARCH(\"Start&End\",B378)),SUM(Q378:INDEX(Q378:Q482,MATCH(TRUE,(B378:B482=\"Start&End\"),0))),SUM(Q378:INDEX(Q378:Q482,MATCH(TRUE,(B378:B482=\"End\"),0)))))","v":""},"",null,null,null,null,null,null,"","","","","","","","",null,"","","","","","","",null,"","","","","","","",null,"","","","","","","",null,"","","","","","",""]
[377,null,null,null,null,null,null,null,null,null,null,null,"","","","","",{"$f":"IF(C379=\"\",\"\",IF(ISNUMBER(SEARCH(\"Start&End\",B379)),SUM(P379:INDEX(P379:P483,MATCH(TRUE,(B379:B483=\"Start&End\"),0))),SUM(P379:INDEX(P379:P483,MATCH(TRUE,(B379:B483=\"End\"),0)))))","v":""},{"$f":"IF(C379=\"\",\"\",IF(ISNUMBER(SEARCH(\"Start&End\",B379)),SUM(Q379:INDEX(Q379:Q483,MATCH(TRUE,(B379:B483=\"Start&End\"),0))),SUM(Q379:INDEX(Q379:Q483,MATCH(TRUE,(B379:B483=\"End\"),0)))))","v":""},"",null,null,null,null,null,null,"","","","","","","","",null,"","","","","","","",null,"","","","","","","",null,"","","","","","","",null,"","","","","","",""]
[378,null,null,null,null,null,null,null,null,null,null,null,"","","","","",{"$f":"IF(C380=\"\",\"\",IF(ISNUMBER(SEARCH(\"Start&End\",B380)),SUM(P380:INDEX(P380:P484,MATCH(TRUE,(B380:B484=\"Start&End\"),0))),SUM(P380:INDEX(P380:P484,MATCH(TRUE,(B380:B484=\"End\"),0)))))","v":""},{"$f":"IF(C380=\"\",\"\",IF(ISNUMBER(SEARCH(\"Start&End\",B380)),SUM(Q380:INDEX(Q380:Q484,MATCH(TRUE,(B380:B484=\"Start&End\"),0))),SUM(Q380:INDEX(Q380:Q484,MATCH(TRUE,(B380:B484=\"End\"),0)))))","v":""},"",null,null,null,null,null,null,"","","","","","","","",null,"","","","","","","",null,"","","","","","","",null,"","","","","","","",null,"","","","","","",""]
[379,null,null,null,null,null,null,null,null,null,null,null,"","","","","",{"$f":"IF(C381=\"\",\"\",IF(ISNUMBER(SEARCH(\"Start&End\",B381)),SUM(P381:INDEX(P381:P485,MATCH(TRUE,(B381:B485=\"Start&End\"),0))),SUM(P381:INDEX(P381:P485,MATCH(TRUE,(B381:B485=\"End\"),0)))))","v":""},{"$f":"IF(C381=\"\",\"\",IF(ISNUMBER(SEARCH(\"Start&End\",B381)),SUM(Q381:INDEX(Q381:Q485,MATCH(TRUE,(B381:B485=\"Start&End\"),0))),SUM(Q381:INDEX(Q381:Q485,MATCH(TRUE,(B381:B485=\"End\"),0)))))","v":""},"",null,null,null,null,null,null,"","","","","","","","",null,"","","","","","","",null,"","","","","","","",null,"","","","","","","",null,"","","","","","",""]
[380,null,null,null,null,null,null,null,null,null,null,null,"","","","","",{"$f":"IF(C382=\"\",\"\",IF(ISNUMBER(SEARCH(\"Start&End\",B382)),SUM(P382:INDEX(P382:P486,MATCH(TRUE,(B382:B486=\"Start&End\"),0))),SUM(P382:INDEX(P382:P486,MATCH(TRUE,(B382:B486=\"End\"),0)))))","v":""},{"$f":"IF(C382=\"\",\"\",IF(ISNUMBER(SEARCH(\"Start&End\",B382)),SUM(Q382:INDEX(Q382:Q486,MATCH(TRUE,(B382:B486=\"Start&End\"),0))),SUM(Q382:INDEX(Q382:Q486,MATCH(TRUE,(B382:B486=\"End\"),0)))))","v":""},"",null,null,null,null,null,null,"","","","","","","","",null,"","","","","","","",null,"","","","","","","",null,"","","","","","","",null,"","","","","","",""]
[381,null,null,null,null,null,null,null,null,null,null,null,"","","","","",{"$f":"IF(C383=\"\",\"\",IF(ISNUMBER(SEARCH(\"Start&End\",B383)),SUM(P383:INDEX(P383:P487,MATCH(TRUE,(B383:B487=\"Start&End\"),0))),SUM(P383:INDEX(P383:P487,MATCH(TRUE,(B383:B487=\"End\"),0)))))","v":""},{"$f":"IF(C383=\"\",\"\",IF(ISNUMBER(SEARCH(\"Start&End\",B383)),SUM(Q383:INDEX(Q383:Q487,MATCH(TRUE,(B383:B487=\"Start&End\"),0))),SUM(Q383:INDEX(Q383:Q487,MATCH(TRUE,(B383:B487=\"End\"),0)))))","v":""},"",null,null,null,null,null,null,"","","","","","","","",null,"","","","","","","",null,"","","","","","","",null,"","","","","","","",null,"","","","","","",""]
[382,null,null,null,null,null,null,null,null,null,null,null,"","","","","",{"$f":"IF(C384=\"\",\"\",IF(ISNUMBER(SEARCH(\"Start&End\",B384)),SUM(P384:INDEX(P384:P488,MATCH(TRUE,(B384:B488=\"Start&End\"),0))),SUM(P384:INDEX(P384:P488,MATCH(TRUE,(B384:B488=\"End\"),0)))))","v":""},{"$f":"IF(C384=\"\",\"\",IF(ISNUMBER(SEARCH(\"Start&End\",B384)),SUM(Q384:INDEX(Q384:Q488,MATCH(TRUE,(B384:B488=\"Start&End\"),0))),SUM(Q384:INDEX(Q384:Q488,MATCH(TRUE,(B384:B488=\"End\"),0)))))","v":""},"",null,null,null,null,null,null,"","","","","","","","",null,"","","","","","","",null,"","","","","","","",null,"","","","","","","",null,"","","","","","",""]
[383,null,null,null,null,null,null,null,null,null,null,null,"","","","","",{"$f":"IF(C385=\"\",\"\",IF(ISNUMBER(SEARCH(\"Start&End\",B385)),SUM(P385:INDEX(P385:P489,MATCH(TRUE,(B385:B489=\"Start&End\"),0))),SUM(P385:INDEX(P385:P489,MATCH(TRUE,(B385:B489=\"End\"),0)))))","v":""},{"$f":"IF(C385=\"\",\"\",IF(ISNUMBER(SEARCH(\"Start&End\",B385)),SUM(Q385:INDEX(Q385:Q489,MATCH(TRUE,(B385:B489=\"Start&End\"),0))),SUM(Q385:INDEX(Q385:Q489,MATCH(TRUE,(B385:B489=\"End\"),0)))))","v":""},"",null,null,null,null,null,null,"","","","","","","","",null,"","","","","","","",null,"","","","","","","",null,"","","","","","","",null,"","","","","","",""]
[384,null,null,null,null,null,null,null,null,null,null,null,"","","","","",{"$f":"IF(C386=\"\",\"\",IF(ISNUMBER(SEARCH(\"Start&End\",B386)),SUM(P386:INDEX(P386:P490,MATCH(TRUE,(B386:B490=\"Start&End\"),0))),SUM(P386:INDEX(P386:P490,MATCH(TRUE,(B386:B490=\"End\"),0)))))","v":""},{"$f":"IF(C386=\"\",\"\",IF(ISNUMBER(SEARCH(\"Start&End\",B386)),SUM(Q386:INDEX(Q386:Q490,MATCH(TRUE,(B386:B490=\"Start&End\"),0))),SUM(Q386:INDEX(Q386:Q490,MATCH(TRUE,(B386:B490=\"End\"),0)))))","v":""},"",null,null,null,null,null,null,"","","","","","","","",null,"","","","","","","",null,"","","","","","","",null,"","","","","","","",null,"","","","","","",""]
[385,null,null,null,null,null,null,null,null,null,null,null,"","","","",{"$f":"IF(AA387=\"\",\"\",O387-P387)","v":""},{"$f":"IF(C387=\"\",\"\",IF(ISNUMBER(SEARCH(\"Start&End\",B387)),SUM(P387:INDEX(P387:P491,MATCH(TRUE,(B387:B491=\"Start&End\"),0))),SUM(P387:INDEX(P387:P491,MATCH(TRUE,(B387:B491=\"End\"),0)))))","v":""},{"$f":"IF(C387=\"\",\"\",IF(ISNUMBER(SEARCH(\"Start&End\",B387)),SUM(Q387:INDEX(Q387:Q491,MATCH(TRUE,(B387:B491=\"Start&End\"),0))),SUM(Q387:INDEX(Q387:Q491,MATCH(TRUE,(B387:B491=\"End\"),0)))))","v":""},{"$f":"IF(ISNUMBER(S387),S387,\"\")","v":""},null,null,null,null,null,null,{"$f":"IF((H387+I387)*G387=0,\"\",(H387+I387)*G387)","v":""},{"$f":"IF(ISNUMBER(SEARCH(\"FUT\",E387)),AZ387,IF(ISNUMBER(SEARCH(\"OPT\",E387)),BH387,IF(ISNUMBER(SEARCH(\"HOLD\",E387)),AJ387,AR387)))","v":""},{"$f":"IF(ISNUMBER(SEARCH(\"HOLD\",E387)),AK387,IF(ISNUMBER(SEARCH(\"INTRA\",E387)),AS387,IF(ISNUMBER(SEARCH(\"FUT\",E387)),BA387,BI387)))","v":""},{"$f":"IF(ISNUMBER(SEARCH(\"HOLD\",E387)),AL387,IF(ISNUMBER(SEARCH(\"INTRA\",E387)),AT387,IF(ISNUMBER(SEARCH(\"FUT\",E387)),BB387,BJ387)))","v":""},{"$f":"IF(ISNUMBER(SEARCH(\"HOLD\",E387)),AM387,IF(ISNUMBER(SEARCH(\"INTRA\",E387)),AU387,IF(ISNUMBER(SEARCH(\"FUT\",E387)),BC387,BK387)))","v":""},{"$f":"IF(ISNUMBER(SEARCH(\"HOLD\",E387)),AN387,IF(ISNUMBER(SEARCH(\"INTRA\",E387)),AV387,IF(ISNUMBER(SEARCH(\"FUT\",E387)),BD387,BL387)))","v":""},{"$f":"IF(ISNUMBER(SEARCH(\"HOLD\",E387)),AO387,IF(ISNUMBER(SEARCH(\"INTRA\",E387)),AW387,IF(ISNUMBER(SEARCH(\"FUT\",E387)),BE387,BM387)))","v":""},"",null,"","","","","",{"$f":"IF(G387&H387=\"\",\"\",ROUND(G387*H387*0.00015,2))","v":""},"",null,{"$f":"IF(MIN(20,((G387*H387*0.0003)))+MIN(20,((G387*H387*0.0003)))=0,\"\",MIN(20,((G387*H387*0.0003)))+MIN(20,((G387*H387*0.0003))))","v":""},{"$f":"IF(I387&G387=\"\",\"\",ROUND(I387*G387*0.00025,0))","v":""},"","","",{"$f":"IF(G387&H387=\"\",\"\",ROUND(G387*H387*0.00003,2))","v":""},"",null,{"$f":"IF(MIN(20,((G387*H387*0.0003)))+MIN(20,((G387*H387*0.0003)))=0,\"\",MIN(20,((G387*H387*0.0003)))+MIN(20,((G387*H387*0.0003))))","v":""},{"$f":"IF(I387&G387=\"\",\"\",ROUND(I387*G387*0.0001,0))","v":""},"","","",{"$f":"IF(G387&H387=\"\",\"\",ROUND(G387*H387*0.00002,2))","v":""},"",null,{"$f":"IF(AA387=\"\",\"\",40)","v":""},{"$f":"IF(I387&G387=\"\",\"\",ROUND(I387*G387*0.0005,0))","v":""},{"$f":"IF(AA387=\"\",\"\",ROUND(AA387*0.00053,2))","v":""},"",{"$f":"IF(AA387=\"\",\"\",ROUND((5/10000000)*AA387,2))","v":""},{"$f":"IF(G387&H387=\"\",\"\",ROUND(G387*H387*0.00003,2))","v":""},""]
[386,null,null,null,null,null,null,null,null,null,null,null,{"$f":"IF(OR(J388=\"\",K388=\"\"),\"\",IF(F388=\"Long\",  ((K388-H388)/(H388-J388)), ((I388-K388)/(J388-I388)) ))","v":""},{"$f":"IF(OR(I388=\"\",D388=\"\",H388=\"\",G388=\"\",E388=\"\",K388=\"\"),\"\",IF(I388=K388,\"Target Achieved\",IF(I388=J388,\"SL Hit\",IF(I388<J388,\"Extended SL Hit\",IF(I388>K388,\"Target Overachieved\",IF(AND(I388>=H388,I388<K388),\"Early Profit Exit\",\"Early Loss Exit\"))))))","v":""},{"$f":"IF(AA388=\"\",\"\",IF(OR(I388=\"\",H388=\"\"),0,G388*(I388-H388)))","v":""},{"$f":"IF(AH388=\"\",\"\",AH388)","v":""},"",{"$f":"IF(C388=\"\",\"\",IF(ISNUMBER(SEARCH(\"Start&End\",B388)),SUM(P388:INDEX(P388:P492,MATCH(TRUE,(B388:B492=\"Start&End\"),0))),SUM(P388:INDEX(P388:P492,MATCH(TRUE,(B388:B492=\"End\"),0)))))","v":""},{"$f":"IF(C388=\"\",\"\",IF(ISNUMBER(SEARCH(\"Start&End\",B388)),SUM(Q388:INDEX(Q388:Q492,MATCH(TRUE,(B388:B492=\"Start&End\"),0))),SUM(Q388:INDEX(Q388:Q492,MATCH(TRUE,(B388:B492=\"End\"),0)))))","v":""},"",null,null,null,null,null,null,"","","","","","","",{"$f":"IF(AB388&AC388&AD388&AE388&AF388&AG388=\"\",\"\",SUM(AB388:AG388))","v":""},null,{"$f":"IF(AA388=\"\",\"\",0)","v":""},{"$f":"IF(AA388=\"\",\"\",ROUND(AA388*0.001,2))","v":""},{"$f":"IF(AA388=\"\",\"\",ROUND(AA388*0.0000345,2))","v":""},{"$f":"IF(AJ388&AL388=\"\",\"\",ROUND((AJ388+AL388)*0.18,2))","v":""},{"$f":"IF(AA388=\"\",\"\",ROUND((5/10000000)*AA388,2))","v":""},"",{"$f":"IF(AK388&AL388&AM388&AN388&AO388=\"\",\"\",SUM(AK388:AO388))","v":""},null,"","",{"$f":"IF(AA388=\"\",\"\",ROUND(AA388*0.0000345,2))","v":""},{"$f":"IF(AR388&AT388=\"\",\"\",ROUND((AR388+AT388)*0.18,2))","v":""},{"$f":"IF(AA388=\"\",\"\",ROUND((5/10000000)*AA388,2))","v":""},"",{"$f":"IF(AR388&AS388&AT388&AU388&AV388&AW388=\"\",\"\",SUM(AR388:AW388))","v":""},null,"","",{"$f":"IF(AA388=\"\",\"\",ROUND(AA388*0.00002,2))","v":""},{"$f":"IF(AZ388&BB388=\"\",\"\",ROUND((AZ388+BB388)*0.18,2))","v":""},{"$f":"IF(AA388=\"\",\"\",ROUND((5/10000000)*AA388,2))","v":""},"","",null,"","","",{"$f":"IF(BH388&BJ388=\"\",\"\",ROUND((BH388+BJ388)*0.18,2))","v":""},"","",{"$f":"IF(BH388&BI388&BJ388&BK388&BL388&BM388=\"\",\"\",SUM(BH388:BM388))","v":""}]
[387,null,null,null,null,null,null,null,null,null,null,null,"","","","","",{"$f":"IF(C389=\"\",\"\",IF(ISNUMBER(SEARCH(\"Start&End\",B389)),SUM(P389:INDEX(P389:P493,MATCH(TRUE,(B389:B493=\"Start&End\"),0))),SUM(P389:INDEX(P389:P493,MATCH(TRUE,(B389:B493=\"End\"),0)))))","v":""},{"$f":"IF(C389=\"\",\"\",IF(ISNUMBER(SEARCH(\"Start&End\",B389)),SUM(Q389:INDEX(Q389:Q493,MATCH(TRUE,(B389:B493=\"Start&End\"),0))),SUM(Q389:INDEX(Q389:Q493,MATCH(TRUE,(B389:B493=\"End\"),0)))))","v":""},"",null,null,null,null,null,null,"","","","","","","","",null,"","","","","","","",null,"","","","","","","",null,"","","","","","",{"$f":"IF(FAX389&BA389&BB389&BC389&BD389&BE389=\"\",\"\",SUM(AZ389:BE389))","v":""},null,"","","","","","",""]
[388,null,null,null,null,null,null,null,null,null,null,null,"","","","","",{"$f":"IF(C390=\"\",\"\",IF(ISNUMBER(SEARCH(\"Start&End\",B390)),SUM(P390:INDEX(P390:P494,MATCH(TRUE,(B390:B494=\"Start&End\"),0))),SUM(P390:INDEX(P390:P494,MATCH(TRUE,(B390:B494=\"End\"),0)))))","v":""},{"$f":"IF(C390=\"\",\"\",IF(ISNUMBER(SEARCH(\"Start&End\",B390)),SUM(Q390:INDEX(Q390:Q494,MATCH(TRUE,(B390:B494=\"Start&End\"),0))),SUM(Q390:INDEX(Q390:Q494,MATCH(TRUE,(B390:B494=\"End\"),0)))))","v":""},"",null,null,null,null,null,null,"","","","","","","","",null,"","","","","","","",null,"","","","","","","",null,"","","","","","","",null,"","","","","","",""]
[389,null,null,null,null,null,null,null,null,null,null,null,"","","","","",{"$f":"IF(C391=\"\",\"\",IF(ISNUMBER(SEARCH(\"Start&End\",B391)),SUM(P391:INDEX(P391:P495,MATCH(TRUE,(B391:B495=\"Start&End\"),0))),SUM(P391:INDEX(P391:P495,MATCH(TRUE,(B391:B495=\"End\"),0)))))","v":""},{"$f":"IF(C391=\"\",\"\",IF(ISNUMBER(SEARCH(\"Start&End\",B391)),SUM(Q391:INDEX(Q391:Q495,MATCH(TRUE,(B391:B495=\"Start&End\"),0))),SUM(Q391:INDEX(Q391:Q495,MATCH(TRUE,(B391:B495=\"End\"),0)))))","v":""},"",null,null,null,null,null,null,"","","","","","","","",null,"","","","","","","",null,"","","","","","","",null,"","","","","","","",null,"","","","","","",""]
[390,null,null,null,null,null,null,null,null,null,null,null,"","","","","",{"$f":"IF(C392=\"\",\"\",IF(ISNUMBER(SEARCH(\"Start&End\",B392)),SUM(P392:INDEX(P392:P496,MATCH(TRUE,(B392:B496=\"Start&End\"),0))),SUM(P392:INDEX(P392:P496,MATCH(TRUE,(B392:B496=\"End\"),0)))))","v":""},{"$f":"IF(C392=\"\",\"\",IF(ISNUMBER(SEARCH(\"Start&End\",B392)),SUM(Q392:INDEX(Q392:Q496,MATCH(TRUE,(B392:B496=\"Start&End\"),0))),SUM(Q392:INDEX(Q392:Q496,MATCH(TRUE,(B392:B496=\"End\"),0)))))","v":""},"",null,null,null,null,null,null,"","","","","","","","",null,"","","","","","","",null,"","","","","","","",null,"","","","","","","",null,"","","","","","",""]
[391,null,null,null,null,null,null,null,null,null,null,null,"","","","","",{"$f":"IF(C393=\"\",\"\",IF(ISNUMBER(SEARCH(\"Start&End\",B393)),SUM(P393:INDEX(P393:P497,MATCH(TRUE,(B393:B497=\"Start&End\"),0))),SUM(P393:INDEX(P393:P497,MATCH(TRUE,(B393:B497=\"End\"),0)))))","v":""},{"$f":"IF(C393=\"\",\"\",IF(ISNUMBER(SEARCH(\"Start&End\",B393)),SUM(Q393:INDEX(Q393:Q497,MATCH(TRUE,(B393:B497=\"Start&End\"),0))),SUM(Q393:INDEX(Q393:Q497,MATCH(TRUE,(B393:B497=\"End\"),0)))))","v":""},"",null,null,null,null,null,null,"","","","","","","","",null,"","","","","","","",null,"","","","","","","",null,"","","","","","","",null,"","","","","","",""]
[392,null,null,null,null,null,null,null,null,null,null,null,"","","","","",{"$f":"IF(C394=\"\",\"\",IF(ISNUMBER(SEARCH(\"Start&End\",B394)),SUM(P394:INDEX(P394:P498,MATCH(TRUE,(B394:B498=\"Start&End\"),0))),SUM(P394:INDEX(P394:P498,MATCH(TRUE,(B394:B498=\"End\"),0)))))","v":""},{"$f":"IF(C394=\"\",\"\",IF(ISNUMBER(SEARCH(\"Start&End\",B394)),SUM(Q394:INDEX(Q394:Q498,MATCH(TRUE,(B394:B498=\"Start&End\"),0))),SUM(Q394:INDEX(Q394:Q498,MATCH(TRUE,(B394:B498=\"End\"),0)))))","v":""},"",null,null,null,null,null,null,"","","","","","","","",null,"","","","","","","",null,"","","","","","","",null,"","","","","","","",null,"","","","","","",""]
[393,null,null,null,null,null,null,null,null,null,null,null,"","","","","",{"$f":"IF(C395=\"\",\"\",IF(ISNUMBER(SEARCH(\"Start&End\",B395)),SUM(P395:INDEX(P395:P499,MATCH(TRUE,(B395:B499=\"Start&End\"),0))),SUM(P395:INDEX(P395:P499,MATCH(TRUE,(B395:B499=\"End\"),0)))))","v":""},{"$f":"IF(C395=\"\",\"\",IF(ISNUMBER(SEARCH(\"Start&End\",B395)),SUM(Q395:INDEX(Q395:Q499,MATCH(TRUE,(B395:B499=\"Start&End\"),0))),SUM(Q395:INDEX(Q395:Q499,MATCH(TRUE,(B395:B499=\"End\"),0)))))","v":""},"",null,null,null,null,null,null,"","","","","","","","",null,"","","","","","","",null,"","","","","","","",null,"","","","","","","",null,"","","","","","",""]
[394,null,null,null,null,null,null,null,null,null,null,null,"","","","","",{"$f":"IF(C396=\"\",\"\",IF(ISNUMBER(SEARCH(\"Start&End\",B396)),SUM(P396:INDEX(P396:P500,MATCH(TRUE,(B396:B500=\"Start&End\"),0))),SUM(P396:INDEX(P396:P500,MATCH(TRUE,(B396:B500=\"End\"),0)))))","v":""},{"$f":"IF(C396=\"\",\"\",IF(ISNUMBER(SEARCH(\"Start&End\",B396)),SUM(Q396:INDEX(Q396:Q500,MATCH(TRUE,(B396:B500=\"Start&End\"),0))),SUM(Q396:INDEX(Q396:Q500,MATCH(TRUE,(B396:B500=\"End\"),0)))))","v":""},"",null,null,null,null,null,null,"","","","","","","","",null,"","","","","","","",null,"","","","","","","",null,"","","","","","","",null,"","","","","","",""]
[395,null,null,null,null,null,null,null,null,null,null,null,"","","","","",{"$f":"IF(C397=\"\",\"\",IF(ISNUMBER(SEARCH(\"Start&End\",B397)),SUM(P397:INDEX(P397:P501,MATCH(TRUE,(B397:B501=\"Start&End\"),0))),SUM(P397:INDEX(P397:P501,MATCH(TRUE,(B397:B501=\"End\"),0)))))","v":""},{"$f":"IF(C397=\"\",\"\",IF(ISNUMBER(SEARCH(\"Start&End\",B397)),SUM(Q397:INDEX(Q397:Q501,MATCH(TRUE,(B397:B501=\"Start&End\"),0))),SUM(Q397:INDEX(Q397:Q501,MATCH(TRUE,(B397:B501=\"End\"),0)))))","v":""},"",null,null,null,null,null,null,"","","","","","","","",null,"","","","","","","",null,"","","","","","","",null,"","","","","","","",null,"","","","","","",""]
[396,null,null,null,null,null,null,null,null,null,null,null,"","","","","",{"$f":"IF(C398=\"\",\"\",IF(ISNUMBER(SEARCH(\"Start&End\",B398)),SUM(P398:INDEX(P398:P502,MATCH(TRUE,(B398:B502=\"Start&End\"),0))),SUM(P398:INDEX(P398:P502,MATCH(TRUE,(B398:B502=\"End\"),0)))))","v":""},{"$f":"IF(C398=\"\",\"\",IF(ISNUMBER(SEARCH(\"Start&End\",B398)),SUM(Q398:INDEX(Q398:Q502,MATCH(TRUE,(B398:B502=\"Start&End\"),0))),SUM(Q398:INDEX(Q398:Q502,MATCH(TRUE,(B398:B502=\"End\"),0)))))","v":""},"",null,null,null,null,null,null,"","","","","","","","",null,"","","","","","","",null,"","","","","","","",null,"","","","","","","",null,"","","","","","",""]
[397,null,null,null,null,null,null,null,null,null,null,null,"","","","","",{"$f":"IF(C399=\"\",\"\",IF(ISNUMBER(SEARCH(\"Start&End\",B399)),SUM(P399:INDEX(P399:P503,MATCH(TRUE,(B399:B503=\"Start&End\"),0))),SUM(P399:INDEX(P399:P503,MATCH(TRUE,(B399:B503=\"End\"),0)))))","v":""},{"$f":"IF(C399=\"\",\"\",IF(ISNUMBER(SEARCH(\"Start&End\",B399)),SUM(Q399:INDEX(Q399:Q503,MATCH(TRUE,(B399:B503=\"Start&End\"),0))),SUM(Q399:INDEX(Q399:Q503,MATCH(TRUE,(B399:B503=\"End\"),0)))))","v":""},"",null,null,null,null,null,null,"","","","","","","","",null,"","","","","","","",null,"","","","","","","",null,"","","","","","","",null,"","","","","","",""]
[398,null,null,null,null,null,null,null,null,null,null,null,"","","","","",{"$f":"IF(C400=\"\",\"\",IF(ISNUMBER(SEARCH(\"Start&End\",B400)),SUM(P400:INDEX(P400:P504,MATCH(TRUE,(B400:B504=\"Start&End\"),0))),SUM(P400:INDEX(P400:P504,MATCH(TRUE,(B400:B504=\"End\"),0)))))","v":""},{"$f":"IF(C400=\"\",\"\",IF(ISNUMBER(SEARCH(\"Start&End\",B400)),SUM(Q400:INDEX(Q400:Q504,MATCH(TRUE,(B400:B504=\"Start&End\"),0))),SUM(Q400:INDEX(Q400:Q504,MATCH(TRUE,(B400:B504=\"End\"),0)))))","v":""},"",null,null,null,null,null,null,"","","","","","","","",null,"","","","","","","",null,"","","","","","","",null,"","","","","","","",null,"","","","","","",""]
[399,null,null,null,null,null,null,null,null,null,null,null,"","","","","",{"$f":"IF(C401=\"\",\"\",IF(ISNUMBER(SEARCH(\"Start&End\",B401)),SUM(P401:INDEX(P401:P505,MATCH(TRUE,(B401:B505=\"Start&End\"),0))),SUM(P401:INDEX(P401:P505,MATCH(TRUE,(B401:B505=\"End\"),0)))))","v":""},{"$f":"IF(C401=\"\",\"\",IF(ISNUMBER(SEARCH(\"Start&End\",B401)),SUM(Q401:INDEX(Q401:Q505,MATCH(TRUE,(B401:B505=\"Start&End\"),0))),SUM(Q401:INDEX(Q401:Q505,MATCH(TRUE,(B401:B505=\"End\"),0)))))","v":""},"",null,null,null,null,null,null,"","","","","","","","",null,"","","","","","","",null,"","","","","","","",null,"","","","","","","",null,"","","","","","",""]
[400,null,null,null,null,null,null,null,null,null,null,null,"","","","","",{"$f":"IF(C402=\"\",\"\",IF(ISNUMBER(SEARCH(\"Start&End\",B402)),SUM(P402:INDEX(P402:P506,MATCH(TRUE,(B402:B506=\"Start&End\"),0))),SUM(P402:INDEX(P402:P506,MATCH(TRUE,(B402:B506=\"End\"),0)))))","v":""},{"$f":"IF(C402=\"\",\"\",IF(ISNUMBER(SEARCH(\"Start&End\",B402)),SUM(Q402:INDEX(Q402:Q506,MATCH(TRUE,(B402:B506=\"Start&End\"),0))),SUM(Q402:INDEX(Q402:Q506,MATCH(TRUE,(B402:B506=\"End\"),0)))))","v":""},"",null,null,null,null,null,null,"","","","","","","","",null,"","","","","","","",null,"","","","","","","",null,"","","","","","","",null,"","","","","","",""]
[401,null,null,null,null,null,null,null,null,null,null,null,"","","","","",{"$f":"IF(C403=\"\",\"\",IF(ISNUMBER(SEARCH(\"Start&End\",B403)),SUM(P403:INDEX(P403:P507,MATCH(TRUE,(B403:B507=\"Start&End\"),0))),SUM(P403:INDEX(P403:P507,MATCH(TRUE,(B403:B507=\"End\"),0)))))","v":""},{"$f":"IF(C403=\"\",\"\",IF(ISNUMBER(SEARCH(\"Start&End\",B403)),SUM(Q403:INDEX(Q403:Q507,MATCH(TRUE,(B403:B507=\"Start&End\"),0))),SUM(Q403:INDEX(Q403:Q507,MATCH(TRUE,(B403:B507=\"End\"),0)))))","v":""},"",null,null,null,null,null,null,"","","","","","","","",null,"","","","","","","",null,"","","","","","","",null,"","","","","","","",null,"","","","","","",""]
[402,null,null,null,null,null,null,null,null,null,null,null,"","","","","",{"$f":"IF(C404=\"\",\"\",IF(ISNUMBER(SEARCH(\"Start&End\",B404)),SUM(P404:INDEX(P404:P508,MATCH(TRUE,(B404:B508=\"Start&End\"),0))),SUM(P404:INDEX(P404:P508,MATCH(TRUE,(B404:B508=\"End\"),0)))))","v":""},{"$f":"IF(C404=\"\",\"\",IF(ISNUMBER(SEARCH(\"Start&End\",B404)),SUM(Q404:INDEX(Q404:Q508,MATCH(TRUE,(B404:B508=\"Start&End\"),0))),SUM(Q404:INDEX(Q404:Q508,MATCH(TRUE,(B404:B508=\"End\"),0)))))","v":""},"",null,null,null,null,null,null,"","","","","","","","",null,"","","","","","","",null,"","","","","","","",null,"","","","","","","",null,"","","","","","",""]
[403,null,null,null,null,null,null,null,null,null,null,null,"","","","","",{"$f":"IF(C405=\"\",\"\",IF(ISNUMBER(SEARCH(\"Start&End\",B405)),SUM(P405:INDEX(P405:P509,MATCH(TRUE,(B405:B509=\"Start&End\"),0))),SUM(P405:INDEX(P405:P509,MATCH(TRUE,(B405:B509=\"End\"),0)))))","v":""},{"$f":"IF(C405=\"\",\"\",IF(ISNUMBER(SEARCH(\"Start&End\",B405)),SUM(Q405:INDEX(Q405:Q509,MATCH(TRUE,(B405:B509=\"Start&End\"),0))),SUM(Q405:INDEX(Q405:Q509,MATCH(TRUE,(B405:B509=\"End\"),0)))))","v":""},"",null,null,null,null,null,null,"","","","","","","","",null,"","","","","","","",null,"","","","","","","",null,"","","","","","","",null,"","","","","","",""]
[404,null,null,null,null,null,null,null,null,null,null,null,"","","","","",{"$f":"IF(C406=\"\",\"\",IF(ISNUMBER(SEARCH(\"Start&End\",B406)),SUM(P406:INDEX(P406:P510,MATCH(TRUE,(B406:B510=\"Start&End\"),0))),SUM(P406:INDEX(P406:P510,MATCH(TRUE,(B406:B510=\"End\"),0)))))","v":""},{"$f":"IF(C406=\"\",\"\",IF(ISNUMBER(SEARCH(\"Start&End\",B406)),SUM(Q406:INDEX(Q406:Q510,MATCH(TRUE,(B406:B510=\"Start&End\"),0))),SUM(Q406:INDEX(Q406:Q510,MATCH(TRUE,(B406:B510=\"End\"),0)))))","v":""},"",null,null,null,null,null,null,"","","","","","","","",null,"","","","","","","",null,"","","","","","","",null,"","","","","","","",null,"","","","","","",""]
[405,null,null,null,null,null,null,null,null,null,null,null,"","","","","",{"$f":"IF(C407=\"\",\"\",IF(ISNUMBER(SEARCH(\"Start&End\",B407)),SUM(P407:INDEX(P407:P511,MATCH(TRUE,(B407:B511=\"Start&End\"),0))),SUM(P407:INDEX(P407:P511,MATCH(TRUE,(B407:B511=\"End\"),0)))))","v":""},{"$f":"IF(C407=\"\",\"\",IF(ISNUMBER(SEARCH(\"Start&End\",B407)),SUM(Q407:INDEX(Q407:Q511,MATCH(TRUE,(B407:B511=\"Start&End\"),0))),SUM(Q407:INDEX(Q407:Q511,MATCH(TRUE,(B407:B511=\"End\"),0)))))","v":""},"",null,null,null,null,null,null,"","","","","","","","",null,"","","","","","","",null,"","","","","","","",null,"","","","","","","",null,"","","","","","",""]
[406,null,null,null,null,null,null,null,null,null,null,null,"","","","","",{"$f":"IF(C408=\"\",\"\",IF(ISNUMBER(SEARCH(\"Start&End\",B408)),SUM(P408:INDEX(P408:P512,MATCH(TRUE,(B408:B512=\"Start&End\"),0))),SUM(P408:INDEX(P408:P512,MATCH(TRUE,(B408:B512=\"End\"),0)))))","v":""},{"$f":"IF(C408=\"\",\"\",IF(ISNUMBER(SEARCH(\"Start&End\",B408)),SUM(Q408:INDEX(Q408:Q512,MATCH(TRUE,(B408:B512=\"Start&End\"),0))),SUM(Q408:INDEX(Q408:Q512,MATCH(TRUE,(B408:B512=\"End\"),0)))))","v":""},"",null,null,null,null,null,null,"","","","","","","","",null,"","","","","","","",null,"","","","","","","",null,"","","","","","","",null,"","","","","","",""]
[407,null,null,null,null,null,null,null,null,null,null,null,"","","","","",{"$f":"IF(C409=\"\",\"\",IF(ISNUMBER(SEARCH(\"Start&End\",B409)),SUM(P409:INDEX(P409:P513,MATCH(TRUE,(B409:B513=\"Start&End\"),0))),SUM(P409:INDEX(P409:P513,MATCH(TRUE,(B409:B513=\"End\"),0)))))","v":""},{"$f":"IF(C409=\"\",\"\",IF(ISNUMBER(SEARCH(\"Start&End\",B409)),SUM(Q409:INDEX(Q409:Q513,MATCH(TRUE,(B409:B513=\"Start&End\"),0))),SUM(Q409:INDEX(Q409:Q513,MATCH(TRUE,(B409:B513=\"End\"),0)))))","v":""},"",null,null,null,null,null,null,"","","","","","","","",null,"","","","","","","",null,"","","","","","","",null,"","","","","","","",null,"","","","","","",""]
[408,null,null,null,null,null,null,null,null,null,null,null,"","","","","",{"$f":"IF(C410=\"\",\"\",IF(ISNUMBER(SEARCH(\"Start&End\",B410)),SUM(P410:INDEX(P410:P514,MATCH(TRUE,(B410:B514=\"Start&End\"),0))),SUM(P410:INDEX(P410:P514,MATCH(TRUE,(B410:B514=\"End\"),0)))))","v":""},{"$f":"IF(C410=\"\",\"\",IF(ISNUMBER(SEARCH(\"Start&End\",B410)),SUM(Q410:INDEX(Q410:Q514,MATCH(TRUE,(B410:B514=\"Start&End\"),0))),SUM(Q410:INDEX(Q410:Q514,MATCH(TRUE,(B410:B514=\"End\"),0)))))","v":""},"",null,null,null,null,null,null,"","","","","","","","",null,"","","","","","","",null,"","","","","","","",null,"","","","","","","",null,"","","","","","",""]
[409,null,null,null,null,null,null,null,null,null,null,null,"","","","","",{"$f":"IF(C411=\"\",\"\",IF(ISNUMBER(SEARCH(\"Start&End\",B411)),SUM(P411:INDEX(P411:P515,MATCH(TRUE,(B411:B515=\"Start&End\"),0))),SUM(P411:INDEX(P411:P515,MATCH(TRUE,(B411:B515=\"End\"),0)))))","v":""},{"$f":"IF(C411=\"\",\"\",IF(ISNUMBER(SEARCH(\"Start&End\",B411)),SUM(Q411:INDEX(Q411:Q515,MATCH(TRUE,(B411:B515=\"Start&End\"),0))),SUM(Q411:INDEX(Q411:Q515,MATCH(TRUE,(B411:B515=\"End\"),0)))))","v":""},"",null,null,null,null,null,null,"","","","","","","","",null,"","","","","","","",null,"","","","","","","",null,"","","","","","","",null,"","","","","","",""]
[410,null,null,null,null,null,null,null,null,null,null,null,"","","","","",{"$f":"IF(C412=\"\",\"\",IF(ISNUMBER(SEARCH(\"Start&End\",B412)),SUM(P412:INDEX(P412:P516,MATCH(TRUE,(B412:B516=\"Start&End\"),0))),SUM(P412:INDEX(P412:P516,MATCH(TRUE,(B412:B516=\"End\"),0)))))","v":""},{"$f":"IF(C412=\"\",\"\",IF(ISNUMBER(SEARCH(\"Start&End\",B412)),SUM(Q412:INDEX(Q412:Q516,MATCH(TRUE,(B412:B516=\"Start&End\"),0))),SUM(Q412:INDEX(Q412:Q516,MATCH(TRUE,(B412:B516=\"End\"),0)))))","v":""},"",null,null,null,null,null,null,"","","","","","","","",null,"","","","","","","",null,"","","","","","","",null,"","","","","","","",null,"","","","","","",""]
[411,null,null,null,null,null,null,null,null,null,null,null,"","","","","",{"$f":"IF(C413=\"\",\"\",IF(ISNUMBER(SEARCH(\"Start&End\",B413)),SUM(P413:INDEX(P413:P517,MATCH(TRUE,(B413:B517=\"Start&End\"),0))),SUM(P413:INDEX(P413:P517,MATCH(TRUE,(B413:B517=\"End\"),0)))))","v":""},{"$f":"IF(C413=\"\",\"\",IF(ISNUMBER(SEARCH(\"Start&End\",B413)),SUM(Q413:INDEX(Q413:Q517,MATCH(TRUE,(B413:B517=\"Start&End\"),0))),SUM(Q413:INDEX(Q413:Q517,MATCH(TRUE,(B413:B517=\"End\"),0)))))","v":""},"",null,null,null,null,null,null,"","","","","","","","",null,"","","","","","","",null,"","","","","","","",null,"","","","","","","",null,"","","","","","",""]
[412,null,null,null,null,null,null,null,null,null,null,null,"","","","","",{"$f":"IF(C414=\"\",\"\",IF(ISNUMBER(SEARCH(\"Start&End\",B414)),SUM(P414:INDEX(P414:P518,MATCH(TRUE,(B414:B518=\"Start&End\"),0))),SUM(P414:INDEX(P414:P518,MATCH(TRUE,(B414:B518=\"End\"),0)))))","v":""},{"$f":"IF(C414=\"\",\"\",IF(ISNUMBER(SEARCH(\"Start&End\",B414)),SUM(Q414:INDEX(Q414:Q518,MATCH(TRUE,(B414:B518=\"Start&End\"),0))),SUM(Q414:INDEX(Q414:Q518,MATCH(TRUE,(B414:B518=\"End\"),0)))))","v":""},"",null,null,null,null,null,null,"","","","","","","","",null,"","","","","","","",null,"","","","","","","",null,"","","","","","","",null,"","","","","","",""]
[413,null,null,null,null,null,null,null,null,null,null,null,"","","","","",{"$f":"IF(C415=\"\",\"\",IF(ISNUMBER(SEARCH(\"Start&End\",B415)),SUM(P415:INDEX(P415:P519,MATCH(TRUE,(B415:B519=\"Start&End\"),0))),SUM(P415:INDEX(P415:P519,MATCH(TRUE,(B415:B519=\"End\"),0)))))","v":""},{"$f":"IF(C415=\"\",\"\",IF(ISNUMBER(SEARCH(\"Start&End\",B415)),SUM(Q415:INDEX(Q415:Q519,MATCH(TRUE,(B415:B519=\"Start&End\"),0))),SUM(Q415:INDEX(Q415:Q519,MATCH(TRUE,(B415:B519=\"End\"),0)))))","v":""},"",null,null,null,null,null,null,"","","","","","","","",null,"","","","","","","",null,"","","","","","","",null,"","","","","","","",null,"","","","","","",""]
[414,null,null,null,null,null,null,null,null,null,null,null,"","","","","",{"$f":"IF(C416=\"\",\"\",IF(ISNUMBER(SEARCH(\"Start&End\",B416)),SUM(P416:INDEX(P416:P520,MATCH(TRUE,(B416:B520=\"Start&End\"),0))),SUM(P416:INDEX(P416:P520,MATCH(TRUE,(B416:B520=\"End\"),0)))))","v":""},{"$f":"IF(C416=\"\",\"\",IF(ISNUMBER(SEARCH(\"Start&End\",B416)),SUM(Q416:INDEX(Q416:Q520,MATCH(TRUE,(B416:B520=\"Start&End\"),0))),SUM(Q416:INDEX(Q416:Q520,MATCH(TRUE,(B416:B520=\"End\"),0)))))","v":""},"",null,null,null,null,null,null,"","","","","","","","",null,"","","","","","","",null,"","","","","","","",null,"","","","","","","",null,"","","","","","",""]
[415,null,null,null,null,null,null,null,null,null,null,null,"","","","","",{"$f":"IF(C417=\"\",\"\",IF(ISNUMBER(SEARCH(\"Start&End\",B417)),SUM(P417:INDEX(P417:P521,MATCH(TRUE,(B417:B521=\"Start&End\"),0))),SUM(P417:INDEX(P417:P521,MATCH(TRUE,(B417:B521=\"End\"),0)))))","v":""},{"$f":"IF(C417=\"\",\"\",IF(ISNUMBER(SEARCH(\"Start&End\",B417)),SUM(Q417:INDEX(Q417:Q521,MATCH(TRUE,(B417:B521=\"Start&End\"),0))),SUM(Q417:INDEX(Q417:Q521,MATCH(TRUE,(B417:B521=\"End\"),0)))))","v":""},"",null,null,null,null,null,null,"","","","","","","","",null,"","","","","","","",null,"","","","","","","",null,"","","","","","","",null,"","","","","","",""]
[416,null,null,null,null,null,null,null,null,null,null,null,"","","","","",{"$f":"IF(C418=\"\",\"\",IF(ISNUMBER(SEARCH(\"Start&End\",B418)),SUM(P418:INDEX(P418:P522,MATCH(TRUE,(B418:B522=\"Start&End\"),0))),SUM(P418:INDEX(P418:P522,MATCH(TRUE,(B418:B522=\"End\"),0)))))","v":""},{"$f":"IF(C418=\"\",\"\",IF(ISNUMBER(SEARCH(\"Start&End\",B418)),SUM(Q418:INDEX(Q418:Q522,MATCH(TRUE,(B418:B522=\"Start&End\"),0))),SUM(Q418:INDEX(Q418:Q522,MATCH(TRUE,(B418:B522=\"End\"),0)))))","v":""},"",null,null,null,null,null,null,"","","","","","","","",null,"","","","","","","",null,"","","","","","","",null,"","","","","","","",null,"","","","","","",""]
[417,null,null,null,null,null,null,null,null,null,null,null,"","","","","",{"$f":"IF(C419=\"\",\"\",IF(ISNUMBER(SEARCH(\"Start&End\",B419)),SUM(P419:INDEX(P419:P523,MATCH(TRUE,(B419:B523=\"Start&End\"),0))),SUM(P419:INDEX(P419:P523,MATCH(TRUE,(B419:B523=\"End\"),0)))))","v":""},{"$f":"IF(C419=\"\",\"\",IF(ISNUMBER(SEARCH(\"Start&End\",B419)),SUM(Q419:INDEX(Q419:Q523,MATCH(TRUE,(B419:B523=\"Start&End\"),0))),SUM(Q419:INDEX(Q419:Q523,MATCH(TRUE,(B419:B523=\"End\"),0)))))","v":""},"",null,null,null,null,null,null,"","","","","","","","",null,"","","","","","","",null,"","","","","","","",null,"","","","","","","",null,"","","","","","",""]
[418,null,null,null,null,null,null,null,null,null,null,null,"","","","","",{"$f":"IF(C420=\"\",\"\",IF(ISNUMBER(SEARCH(\"Start&End\",B420)),SUM(P420:INDEX(P420:P524,MATCH(TRUE,(B420:B524=\"Start&End\"),0))),SUM(P420:INDEX(P420:P524,MATCH(TRUE,(B420:B524=\"End\"),0)))))","v":""},{"$f":"IF(C420=\"\",\"\",IF(ISNUMBER(SEARCH(\"Start&End\",B420)),SUM(Q420:INDEX(Q420:Q524,MATCH(TRUE,(B420:B524=\"Start&End\"),0))),SUM(Q420:INDEX(Q420:Q524,MATCH(TRUE,(B420:B524=\"End\"),0)))))","v":""},"",null,null,null,null,null,null,"","","","","","","","",null,"","","","","","","",null,"","","","","","","",null,"","","","","","","",null,"","","","","","",""]
[419,null,null,null,null,null,null,null,null,null,null,null,"","","","","",{"$f":"IF(C421=\"\",\"\",IF(ISNUMBER(SEARCH(\"Start&End\",B421)),SUM(P421:INDEX(P421:P525,MATCH(TRUE,(B421:B525=\"Start&End\"),0))),SUM(P421:INDEX(P421:P525,MATCH(TRUE,(B421:B525=\"End\"),0)))))","v":""},{"$f":"IF(C421=\"\",\"\",IF(ISNUMBER(SEARCH(\"Start&End\",B421)),SUM(Q421:INDEX(Q421:Q525,MATCH(TRUE,(B421:B525=\"Start&End\"),0))),SUM(Q421:INDEX(Q421:Q525,MATCH(TRUE,(B421:B525=\"End\"),0)))))","v":""},"",null,null,null,null,null,null,"","","","","","","","",null,"","","","","","","",null,"","","","","","","",null,"","","","","","","",null,"","","","","","",""]
[420,null,null,null,null,null,null,null,null,null,null,null,"","","","","",{"$f":"IF(C422=\"\",\"\",IF(ISNUMBER(SEARCH(\"Start&End\",B422)),SUM(P422:INDEX(P422:P526,MATCH(TRUE,(B422:B526=\"Start&End\"),0))),SUM(P422:INDEX(P422:P526,MATCH(TRUE,(B422:B526=\"End\"),0)))))","v":""},{"$f":"IF(C422=\"\",\"\",IF(ISNUMBER(SEARCH(\"Start&End\",B422)),SUM(Q422:INDEX(Q422:Q526,MATCH(TRUE,(B422:B526=\"Start&End\"),0))),SUM(Q422:INDEX(Q422:Q526,MATCH(TRUE,(B422:B526=\"End\"),0)))))","v":""},"",null,null,null,null,null,null,"","","","","","","","",null,"","","","","","","",null,"","","","","","","",null,"","","","","","","",null,"","","","","","",""]
[421,null,null,null,null,null,null,null,null,null,null,null,"","","","","",{"$f":"IF(C423=\"\",\"\",IF(ISNUMBER(SEARCH(\"Start&End\",B423)),SUM(P423:INDEX(P423:P527,MATCH(TRUE,(B423:B527=\"Start&End\"),0))),SUM(P423:INDEX(P423:P527,MATCH(TRUE,(B423:B527=\"End\"),0)))))","v":""},{"$f":"IF(C423=\"\",\"\",IF(ISNUMBER(SEARCH(\"Start&End\",B423)),SUM(Q423:INDEX(Q423:Q527,MATCH(TRUE,(B423:B527=\"Start&End\"),0))),SUM(Q423:INDEX(Q423:Q527,MATCH(TRUE,(B423:B527=\"End\"),0)))))","v":""},"",null,null,null,null,null,null,"","","","","","","","",null,"","","","","","","",null,"","","","","","","",null,"","","","","","","",null,"","","","","","",""]
[422,null,null,null,null,null,null,null,null,null,null,null,"","","","","",{"$f":"IF(C424=\"\",\"\",IF(ISNUMBER(SEARCH(\"Start&End\",B424)),SUM(P424:INDEX(P424:P528,MATCH(TRUE,(B424:B528=\"Start&End\"),0))),SUM(P424:INDEX(P424:P528,MATCH(TRUE,(B424:B528=\"End\"),0)))))","v":""},{"$f":"IF(C424=\"\",\"\",IF(ISNUMBER(SEARCH(\"Start&End\",B424)),SUM(Q424:INDEX(Q424:Q528,MATCH(TRUE,(B424:B528=\"Start&End\"),0))),SUM(Q424:INDEX(Q424:Q528,MATCH(TRUE,(B424:B528=\"End\"),0)))))","v":""},"",null,null,null,null,null,null,"","","","","","","","",null,"","","","","","","",null,"","","","","","","",null,"","","","","","","",null,"","","","","","",""]
[423,null,null,null,null,null,null,null,null,null,null,null,"","","","","",{"$f":"IF(C425=\"\",\"\",IF(ISNUMBER(SEARCH(\"Start&End\",B425)),SUM(P425:INDEX(P425:P529,MATCH(TRUE,(B425:B529=\"Start&End\"),0))),SUM(P425:INDEX(P425:P529,MATCH(TRUE,(B425:B529=\"End\"),0)))))","v":""},{"$f":"IF(C425=\"\",\"\",IF(ISNUMBER(SEARCH(\"Start&End\",B425)),SUM(Q425:INDEX(Q425:Q529,MATCH(TRUE,(B425:B529=\"Start&End\"),0))),SUM(Q425:INDEX(Q425:Q529,MATCH(TRUE,(B425:B529=\"End\"),0)))))","v":""},"",null,null,null,null,null,null,"","","","","","","","",null,"","","","","","","",null,"","","","","","","",null,"","","","","","","",null,"","","","","","",""]
[424,null,null,null,null,null,null,null,null,null,null,null,"","","","","",{"$f":"IF(C426=\"\",\"\",IF(ISNUMBER(SEARCH(\"Start&End\",B426)),SUM(P426:INDEX(P426:P530,MATCH(TRUE,(B426:B530=\"Start&End\"),0))),SUM(P426:INDEX(P426:P530,MATCH(TRUE,(B426:B530=\"End\"),0)))))","v":""},{"$f":"IF(C426=\"\",\"\",IF(ISNUMBER(SEARCH(\"Start&End\",B426)),SUM(Q426:INDEX(Q426:Q530,MATCH(TRUE,(B426:B530=\"Start&End\"),0))),SUM(Q426:INDEX(Q426:Q530,MATCH(TRUE,(B426:B530=\"End\"),0)))))","v":""},"",null,null,null,null,null,null,"","","","","","","","",null,"","","","","","","",null,"","","","","","","",null,"","","","","","","",null,"","","","","","",""]
[425,null,null,null,null,null,null,null,null,null,null,null,"","","","","",{"$f":"IF(C427=\"\",\"\",IF(ISNUMBER(SEARCH(\"Start&End\",B427)),SUM(P427:INDEX(P427:P531,MATCH(TRUE,(B427:B531=\"Start&End\"),0))),SUM(P427:INDEX(P427:P531,MATCH(TRUE,(B427:B531=\"End\"),0)))))","v":""},{"$f":"IF(C427=\"\",\"\",IF(ISNUMBER(SEARCH(\"Start&End\",B427)),SUM(Q427:INDEX(Q427:Q531,MATCH(TRUE,(B427:B531=\"Start&End\"),0))),SUM(Q427:INDEX(Q427:Q531,MATCH(TRUE,(B427:B531=\"End\"),0)))))","v":""},"",null,null,null,null,null,null,"","","","","","","","",null,"","","","","","","",null,"","","","","","","",null,"","","","","","","",null,"","","","","","",""]
[426,null,null,null,null,null,null,null,null,null,null,null,"","","","","",{"$f":"IF(C428=\"\",\"\",IF(ISNUMBER(SEARCH(\"Start&End\",B428)),SUM(P428:INDEX(P428:P532,MATCH(TRUE,(B428:B532=\"Start&End\"),0))),SUM(P428:INDEX(P428:P532,MATCH(TRUE,(B428:B532=\"End\"),0)))))","v":""},{"$f":"IF(C428=\"\",\"\",IF(ISNUMBER(SEARCH(\"Start&End\",B428)),SUM(Q428:INDEX(Q428:Q532,MATCH(TRUE,(B428:B532=\"Start&End\"),0))),SUM(Q428:INDEX(Q428:Q532,MATCH(TRUE,(B428:B532=\"End\"),0)))))","v":""},"",null,null,null,null,null,null,"","","","","","","","",null,"","","","","","","",null,"","","","","","","",null,"","","","","","","",null,"","","","","","",""]
[427,null,null,null,null,null,null,null,null,null,null,null,"","","","","",{"$f":"IF(C429=\"\",\"\",IF(ISNUMBER(SEARCH(\"Start&End\",B429)),SUM(P429:INDEX(P429:P533,MATCH(TRUE,(B429:B533=\"Start&End\"),0))),SUM(P429:INDEX(P429:P533,MATCH(TRUE,(B429:B533=\"End\"),0)))))","v":""},{"$f":"IF(C429=\"\",\"\",IF(ISNUMBER(SEARCH(\"Start&End\",B429)),SUM(Q429:INDEX(Q429:Q533,MATCH(TRUE,(B429:B533=\"Start&End\"),0))),SUM(Q429:INDEX(Q429:Q533,MATCH(TRUE,(B429:B533=\"End\"),0)))))","v":""},"",null,null,null,null,null,null,"","","","","","","","",null,"","","","","","","",null,"","","","","","","",null,"","","","","","","",null,"","","","","","",""]
[428,null,null,null,null,null,null,null,null,null,null,null,"","","","","",{"$f":"IF(C430=\"\",\"\",IF(ISNUMBER(SEARCH(\"Start&End\",B430)),SUM(P430:INDEX(P430:P534,MATCH(TRUE,(B430:B534=\"Start&End\"),0))),SUM(P430:INDEX(P430:P534,MATCH(TRUE,(B430:B534=\"End\"),0)))))","v":""},{"$f":"IF(C430=\"\",\"\",IF(ISNUMBER(SEARCH(\"Start&End\",B430)),SUM(Q430:INDEX(Q430:Q534,MATCH(TRUE,(B430:B534=\"Start&End\"),0))),SUM(Q430:INDEX(Q430:Q534,MATCH(TRUE,(B430:B534=\"End\"),0)))))","v":""},"",null,null,null,null,null,null,"","","","","","","","",null,"","","","","","","",null,"","","","","","","",null,"","","","","","","",null,"","","","","","",""]
[429,null,null,null,null,null,null,null,null,null,null,null,"","","","","",{"$f":"IF(C431=\"\",\"\",IF(ISNUMBER(SEARCH(\"Start&End\",B431)),SUM(P431:INDEX(P431:P535,MATCH(TRUE,(B431:B535=\"Start&End\"),0))),SUM(P431:INDEX(P431:P535,MATCH(TRUE,(B431:B535=\"End\"),0)))))","v":""},{"$f":"IF(C431=\"\",\"\",IF(ISNUMBER(SEARCH(\"Start&End\",B431)),SUM(Q431:INDEX(Q431:Q535,MATCH(TRUE,(B431:B535=\"Start&End\"),0))),SUM(Q431:INDEX(Q431:Q535,MATCH(TRUE,(B431:B535=\"End\"),0)))))","v":""},"",null,null,null,null,null,null,"","","","","","","","",null,"","","","","","","",null,"","","","","","","",null,"","","","","","","",null,"","","","","","",""]
[430,null,null,null,null,null,null,null,null,null,null,null,"","","","","",{"$f":"IF(C432=\"\",\"\",IF(ISNUMBER(SEARCH(\"Start&End\",B432)),SUM(P432:INDEX(P432:P536,MATCH(TRUE,(B432:B536=\"Start&End\"),0))),SUM(P432:INDEX(P432:P536,MATCH(TRUE,(B432:B536=\"End\"),0)))))","v":""},{"$f":"IF(C432=\"\",\"\",IF(ISNUMBER(SEARCH(\"Start&End\",B432)),SUM(Q432:INDEX(Q432:Q536,MATCH(TRUE,(B432:B536=\"Start&End\"),0))),SUM(Q432:INDEX(Q432:Q536,MATCH(TRUE,(B432:B536=\"End\"),0)))))","v":""},"",null,null,null,null,null,null,"","","","","","","","",null,"","","","","","","",null,"","","","","","","",null,"","","","","","","",null,"","","","","","",""]
[431,null,null,null,null,null,null,null,null,null,null,null,"","","","","",{"$f":"IF(C433=\"\",\"\",IF(ISNUMBER(SEARCH(\"Start&End\",B433)),SUM(P433:INDEX(P433:P537,MATCH(TRUE,(B433:B537=\"Start&End\"),0))),SUM(P433:INDEX(P433:P537,MATCH(TRUE,(B433:B537=\"End\"),0)))))","v":""},{"$f":"IF(C433=\"\",\"\",IF(ISNUMBER(SEARCH(\"Start&End\",B433)),SUM(Q433:INDEX(Q433:Q537,MATCH(TRUE,(B433:B537=\"Start&End\"),0))),SUM(Q433:INDEX(Q433:Q537,MATCH(TRUE,(B433:B537=\"End\"),0)))))","v":""},"",null,null,null,null,null,null,"","","","","","","","",null,"","","","","","","",null,"","","","","","","",null,"","","","","","","",null,"","","","","","",""]
[432,null,null,null,null,null,null,null,null,null,null,null,"","","","","",{"$f":"IF(C434=\"\",\"\",IF(ISNUMBER(SEARCH(\"Start&End\",B434)),SUM(P434:INDEX(P434:P538,MATCH(TRUE,(B434:B538=\"Start&End\"),0))),SUM(P434:INDEX(P434:P538,MATCH(TRUE,(B434:B538=\"End\"),0)))))","v":""},{"$f":"IF(C434=\"\",\"\",IF(ISNUMBER(SEARCH(\"Start&End\",B434)),SUM(Q434:INDEX(Q434:Q538,MATCH(TRUE,(B434:B538=\"Start&End\"),0))),SUM(Q434:INDEX(Q434:Q538,MATCH(TRUE,(B434:B538=\"End\"),0)))))","v":""},"",null,null,null,null,null,null,"","","","","","","","",null,"","","","","","","",null,"","","","","","","",null,"","","","","","","",null,"","","","","","",""]
[433,null,null,null,null,null,null,null,null,null,null,null,"","","","","",{"$f":"IF(C435=\"\",\"\",IF(ISNUMBER(SEARCH(\"Start&End\",B435)),SUM(P435:INDEX(P435:P539,MATCH(TRUE,(B435:B539=\"Start&End\"),0))),SUM(P435:INDEX(P435:P539,MATCH(TRUE,(B435:B539=\"End\"),0)))))","v":""},{"$f":"IF(C435=\"\",\"\",IF(ISNUMBER(SEARCH(\"Start&End\",B435)),SUM(Q435:INDEX(Q435:Q539,MATCH(TRUE,(B435:B539=\"Start&End\"),0))),SUM(Q435:INDEX(Q435:Q539,MATCH(TRUE,(B435:B539=\"End\"),0)))))","v":""},"",null,null,null,null,null,null,"","","","","","","","",null,"","","","","","","",null,"","","","","","","",null,"","","","","","","",null,"","","","","","",""]
[434,null,null,null,null,null,null,null,null,null,null,null,"","","","","",{"$f":"IF(C436=\"\",\"\",IF(ISNUMBER(SEARCH(\"Start&End\",B436)),SUM(P436:INDEX(P436:P540,MATCH(TRUE,(B436:B540=\"Start&End\"),0))),SUM(P436:INDEX(P436:P540,MATCH(TRUE,(B436:B540=\"End\"),0)))))","v":""},{"$f":"IF(C436=\"\",\"\",IF(ISNUMBER(SEARCH(\"Start&End\",B436)),SUM(Q436:INDEX(Q436:Q540,MATCH(TRUE,(B436:B540=\"Start&End\"),0))),SUM(Q436:INDEX(Q436:Q540,MATCH(TRUE,(B436:B540=\"End\"),0)))))","v":""},"",null,null,null,null,null,null,"","","","","","","","",null,"","","","","","","",null,"","","","","","","",null,"","","","","","","",null,"","","","","","",""]
[435,null,null,null,null,null,null,null,null,null,null,null,"","","","","",{"$f":"IF(C437=\"\",\"\",IF(ISNUMBER(SEARCH(\"Start&End\",B437)),SUM(P437:INDEX(P437:P541,MATCH(TRUE,(B437:B541=\"Start&End\"),0))),SUM(P437:INDEX(P437:P541,MATCH(TRUE,(B437:B541=\"End\"),0)))))","v":""},{"$f":"IF(C437=\"\",\"\",IF(ISNUMBER(SEARCH(\"Start&End\",B437)),SUM(Q437:INDEX(Q437:Q541,MATCH(TRUE,(B437:B541=\"Start&End\"),0))),SUM(Q437:INDEX(Q437:Q541,MATCH(TRUE,(B437:B541=\"End\"),0)))))","v":""},"",null,null,null,null,null,null,"","","","","","","","",null,"","","","","","","",null,"","","","","","","",null,"","","","","","","",null,"","","","","","",""]
[436,null,null,null,null,null,null,null,null,null,null,null,"","","","","",{"$f":"IF(C438=\"\",\"\",IF(ISNUMBER(SEARCH(\"Start&End\",B438)),SUM(P438:INDEX(P438:P542,MATCH(TRUE,(B438:B542=\"Start&End\"),0))),SUM(P438:INDEX(P438:P542,MATCH(TRUE,(B438:B542=\"End\"),0)))))","v":""},{"$f":"IF(C438=\"\",\"\",IF(ISNUMBER(SEARCH(\"Start&End\",B438)),SUM(Q438:INDEX(Q438:Q542,MATCH(TRUE,(B438:B542=\"Start&End\"),0))),SUM(Q438:INDEX(Q438:Q542,MATCH(TRUE,(B438:B542=\"End\"),0)))))","v":""},"",null,null,null,null,null,null,"","","","","","","","",null,"","","","","","","",null,"","","","","","","",null,"","","","","","","",null,"","","","","","",""]
[437,null,null,null,null,null,null,null,null,null,null,null,"","","","","",{"$f":"IF(C439=\"\",\"\",IF(ISNUMBER(SEARCH(\"Start&End\",B439)),SUM(P439:INDEX(P439:P543,MATCH(TRUE,(B439:B543=\"Start&End\"),0))),SUM(P439:INDEX(P439:P543,MATCH(TRUE,(B439:B543=\"End\"),0)))))","v":""},{"$f":"IF(C439=\"\",\"\",IF(ISNUMBER(SEARCH(\"Start&End\",B439)),SUM(Q439:INDEX(Q439:Q543,MATCH(TRUE,(B439:B543=\"Start&End\"),0))),SUM(Q439:INDEX(Q439:Q543,MATCH(TRUE,(B439:B543=\"End\"),0)))))","v":""},"",null,null,null,null,null,null,"","","","","","","","",null,"","","","","","","",null,"","","","","","","",null,"","","","","","","",null,"","","","","","",""]
[438,null,null,null,null,null,null,null,null,null,null,null,"","","","","",{"$f":"IF(C440=\"\",\"\",IF(ISNUMBER(SEARCH(\"Start&End\",B440)),SUM(P440:INDEX(P440:P544,MATCH(TRUE,(B440:B544=\"Start&End\"),0))),SUM(P440:INDEX(P440:P544,MATCH(TRUE,(B440:B544=\"End\"),0)))))","v":""},{"$f":"IF(C440=\"\",\"\",IF(ISNUMBER(SEARCH(\"Start&End\",B440)),SUM(Q440:INDEX(Q440:Q544,MATCH(TRUE,(B440:B544=\"Start&End\"),0))),SUM(Q440:INDEX(Q440:Q544,MATCH(TRUE,(B440:B544=\"End\"),0)))))","v":""},"",null,null,null,null,null,null,"","","","","","","","",null,"","","","","","","",null,"","","","","","","",null,"","","","","","","",null,"","","","","","",""]
[439,null,null,null,null,null,null,null,null,null,null,null,"","","","","",{"$f":"IF(C441=\"\",\"\",IF(ISNUMBER(SEARCH(\"Start&End\",B441)),SUM(P441:INDEX(P441:P545,MATCH(TRUE,(B441:B545=\"Start&End\"),0))),SUM(P441:INDEX(P441:P545,MATCH(TRUE,(B441:B545=\"End\"),0)))))","v":""},{"$f":"IF(C441=\"\",\"\",IF(ISNUMBER(SEARCH(\"Start&End\",B441)),SUM(Q441:INDEX(Q441:Q545,MATCH(TRUE,(B441:B545=\"Start&End\"),0))),SUM(Q441:INDEX(Q441:Q545,MATCH(TRUE,(B441:B545=\"End\"),0)))))","v":""},"",null,null,null,null,null,null,"","","","","","","","",null,"","","","","","","",null,"","","","","","","",null,"","","","","","","",null,"","","","","","",""]
[440,null,null,null,null,null,null,null,null,null,null,null,"","","","","",{"$f":"IF(C442=\"\",\"\",IF(ISNUMBER(SEARCH(\"Start&End\",B442)),SUM(P442:INDEX(P442:P546,MATCH(TRUE,(B442:B546=\"Start&End\"),0))),SUM(P442:INDEX(P442:P546,MATCH(TRUE,(B442:B546=\"End\"),0)))))","v":""},{"$f":"IF(C442=\"\",\"\",IF(ISNUMBER(SEARCH(\"Start&End\",B442)),SUM(Q442:INDEX(Q442:Q546,MATCH(TRUE,(B442:B546=\"Start&End\"),0))),SUM(Q442:INDEX(Q442:Q546,MATCH(TRUE,(B442:B546=\"End\"),0)))))","v":""},"",null,null,null,null,null,null,"","","","","","","","",null,"","","","","","","",null,"","","","","","","",null,"","","","","","","",null,"","","","","","",""]
[441,null,null,null,null,null,null,null,null,null,null,null,"","","","","",{"$f":"IF(C443=\"\",\"\",IF(ISNUMBER(SEARCH(\"Start&End\",B443)),SUM(P443:INDEX(P443:P547,MATCH(TRUE,(B443:B547=\"Start&End\"),0))),SUM(P443:INDEX(P443:P547,MATCH(TRUE,(B443:B547=\"End\"),0)))))","v":""},{"$f":"IF(C443=\"\",\"\",IF(ISNUMBER(SEARCH(\"Start&End\",B443)),SUM(Q443:INDEX(Q443:Q547,MATCH(TRUE,(B443:B547=\"Start&End\"),0))),SUM(Q443:INDEX(Q443:Q547,MATCH(TRUE,(B443:B547=\"End\"),0)))))","v":""},"",null,null,null,null,null,null,"","","","","","","","",null,"","","","","","","",null,"","","","","","","",null,"","","","","","","",null,"","","","","","",""]
[442,null,null,null,null,null,null,null,null,null,null,null,"","","","","",{"$f":"IF(C444=\"\",\"\",IF(ISNUMBER(SEARCH(\"Start&End\",B444)),SUM(P444:INDEX(P444:P548,MATCH(TRUE,(B444:B548=\"Start&End\"),0))),SUM(P444:INDEX(P444:P548,MATCH(TRUE,(B444:B548=\"End\"),0)))))","v":""},{"$f":"IF(C444=\"\",\"\",IF(ISNUMBER(SEARCH(\"Start&End\",B444)),SUM(Q444:INDEX(Q444:Q548,MATCH(TRUE,(B444:B548=\"Start&End\"),0))),SUM(Q444:INDEX(Q444:Q548,MATCH(TRUE,(B444:B548=\"End\"),0)))))","v":""},"",null,null,null,null,null,null,"","","","","","","","",null,"","","","","","","",null,"","","","","","","",null,"","","","","","","",null,"","","","","","",""]
[443,null,null,null,null,null,null,null,null,null,null,null,"","","","","",{"$f":"IF(C445=\"\",\"\",IF(ISNUMBER(SEARCH(\"Start&End\",B445)),SUM(P445:INDEX(P445:P549,MATCH(TRUE,(B445:B549=\"Start&End\"),0))),SUM(P445:INDEX(P445:P549,MATCH(TRUE,(B445:B549=\"End\"),0)))))","v":""},{"$f":"IF(C445=\"\",\"\",IF(ISNUMBER(SEARCH(\"Start&End\",B445)),SUM(Q445:INDEX(Q445:Q549,MATCH(TRUE,(B445:B549=\"Start&End\"),0))),SUM(Q445:INDEX(Q445:Q549,MATCH(TRUE,(B445:B549=\"End\"),0)))))","v":""},"",null,null,null,null,null,null,"","","","","","","","",null,"","","","","","","",null,"","","","","","","",null,"","","","","","","",null,"","","","","","",""]
[444,null,null,null,null,null,null,null,null,null,null,null,"","","","","",{"$f":"IF(C446=\"\",\"\",IF(ISNUMBER(SEARCH(\"Start&End\",B446)),SUM(P446:INDEX(P446:P550,MATCH(TRUE,(B446:B550=\"Start&End\"),0))),SUM(P446:INDEX(P446:P550,MATCH(TRUE,(B446:B550=\"End\"),0)))))","v":""},{"$f":"IF(C446=\"\",\"\",IF(ISNUMBER(SEARCH(\"Start&End\",B446)),SUM(Q446:INDEX(Q446:Q550,MATCH(TRUE,(B446:B550=\"Start&End\"),0))),SUM(Q446:INDEX(Q446:Q550,MATCH(TRUE,(B446:B550=\"End\"),0)))))","v":""},"",null,null,null,null,null,null,"","","","","","","","",null,"","","","","","","",null,"","","","","","","",null,"","","","","","","",null,"","","","","","",""]
[445,null,null,null,null,null,null,null,null,null,null,null,"","","","","",{"$f":"IF(C447=\"\",\"\",IF(ISNUMBER(SEARCH(\"Start&End\",B447)),SUM(P447:INDEX(P447:P551,MATCH(TRUE,(B447:B551=\"Start&End\"),0))),SUM(P447:INDEX(P447:P551,MATCH(TRUE,(B447:B551=\"End\"),0)))))","v":""},{"$f":"IF(C447=\"\",\"\",IF(ISNUMBER(SEARCH(\"Start&End\",B447)),SUM(Q447:INDEX(Q447:Q551,MATCH(TRUE,(B447:B551=\"Start&End\"),0))),SUM(Q447:INDEX(Q447:Q551,MATCH(TRUE,(B447:B551=\"End\"),0)))))","v":""},"",null,null,null,null,null,null,"","","","","","","","",null,"","","","","","","",null,"","","","","","","",null,"","","","","","","",null,"","","","","","",""]
[446,null,null,null,null,null,null,null,null,null,null,null,"","","","","",{"$f":"IF(C448=\"\",\"\",IF(ISNUMBER(SEARCH(\"Start&End\",B448)),SUM(P448:INDEX(P448:P552,MATCH(TRUE,(B448:B552=\"Start&End\"),0))),SUM(P448:INDEX(P448:P552,MATCH(TRUE,(B448:B552=\"End\"),0)))))","v":""},{"$f":"IF(C448=\"\",\"\",IF(ISNUMBER(SEARCH(\"Start&End\",B448)),SUM(Q448:INDEX(Q448:Q552,MATCH(TRUE,(B448:B552=\"Start&End\"),0))),SUM(Q448:INDEX(Q448:Q552,MATCH(TRUE,(B448:B552=\"End\"),0)))))","v":""},"",null,null,null,null,null,null,"","","","","","","","",null,"","","","","","","",null,"","","","","","","",null,"","","","","","","",null,"","","","","","",""]
[447,null,null,null,null,null,null,null,null,null,null,null,"","","","","",{"$f":"IF(C449=\"\",\"\",IF(ISNUMBER(SEARCH(\"Start&End\",B449)),SUM(P449:INDEX(P449:P553,MATCH(TRUE,(B449:B553=\"Start&End\"),0))),SUM(P449:INDEX(P449:P553,MATCH(TRUE,(B449:B553=\"End\"),0)))))","v":""},{"$f":"IF(C449=\"\",\"\",IF(ISNUMBER(SEARCH(\"Start&End\",B449)),SUM(Q449:INDEX(Q449:Q553,MATCH(TRUE,(B449:B553=\"Start&End\"),0))),SUM(Q449:INDEX(Q449:Q553,MATCH(TRUE,(B449:B553=\"End\"),0)))))","v":""},"",null,null,null,null,null,null,"","","","","","","","",null,"","","","","","","",null,"","","","","","","",null,"","","","","","","",null,"","","","","","",""]
[448,null,null,null,null,null,null,null,null,null,null,null,"","","","","",{"$f":"IF(C450=\"\",\"\",IF(ISNUMBER(SEARCH(\"Start&End\",B450)),SUM(P450:INDEX(P450:P554,MATCH(TRUE,(B450:B554=\"Start&End\"),0))),SUM(P450:INDEX(P450:P554,MATCH(TRUE,(B450:B554=\"End\"),0)))))","v":""},{"$f":"IF(C450=\"\",\"\",IF(ISNUMBER(SEARCH(\"Start&End\",B450)),SUM(Q450:INDEX(Q450:Q554,MATCH(TRUE,(B450:B554=\"Start&End\"),0))),SUM(Q450:INDEX(Q450:Q554,MATCH(TRUE,(B450:B554=\"End\"),0)))))","v":""},"",null,null,null,null,null,null,"","","","","","","","",null,"","","","","","","",null,"","","","","","","",null,"","","","","","","",null,"","","","","","",""]
[449,null,null,null,null,null,null,null,null,null,null,null,"","","","",{"$f":"IF(AA451=\"\",\"\",O451-P451)","v":""},{"$f":"IF(C451=\"\",\"\",IF(ISNUMBER(SEARCH(\"Start&End\",B451)),SUM(P451:INDEX(P451:P555,MATCH(TRUE,(B451:B555=\"Start&End\"),0))),SUM(P451:INDEX(P451:P555,MATCH(TRUE,(B451:B555=\"End\"),0)))))","v":""},{"$f":"IF(C451=\"\",\"\",IF(ISNUMBER(SEARCH(\"Start&End\",B451)),SUM(Q451:INDEX(Q451:Q555,MATCH(TRUE,(B451:B555=\"Start&End\"),0))),SUM(Q451:INDEX(Q451:Q555,MATCH(TRUE,(B451:B555=\"End\"),0)))))","v":""},{"$f":"IF(ISNUMBER(S451),S451,\"\")","v":""},null,null,null,null,null,null,{"$f":"IF((H451+I451)*G451=0,\"\",(H451+I451)*G451)","v":""},{"$f":"IF(ISNUMBER(SEARCH(\"FUT\",E451)),AZ451,IF(ISNUMBER(SEARCH(\"OPT\",E451)),BH451,IF(ISNUMBER(SEARCH(\"HOLD\",E451)),AJ451,AR451)))","v":""},{"$f":"IF(ISNUMBER(SEARCH(\"HOLD\",E451)),AK451,IF(ISNUMBER(SEARCH(\"INTRA\",E451)),AS451,IF(ISNUMBER(SEARCH(\"FUT\",E451)),BA451,BI451)))","v":""},{"$f":"IF(ISNUMBER(SEARCH(\"HOLD\",E451)),AL451,IF(ISNUMBER(SEARCH(\"INTRA\",E451)),AT451,IF(ISNUMBER(SEARCH(\"FUT\",E451)),BB451,BJ451)))","v":""},{"$f":"IF(ISNUMBER(SEARCH(\"HOLD\",E451)),AM451,IF(ISNUMBER(SEARCH(\"INTRA\",E451)),AU451,IF(ISNUMBER(SEARCH(\"FUT\",E451)),BC451,BK451)))","v":""},{"$f":"IF(ISNUMBER(SEARCH(\"HOLD\",E451)),AN451,IF(ISNUMBER(SEARCH(\"INTRA\",E451)),AV451,IF(ISNUMBER(SEARCH(\"FUT\",E451)),BD451,BL451)))","v":""},{"$f":"IF(ISNUMBER(SEARCH(\"HOLD\",E451)),AO451,IF(ISNUMBER(SEARCH(\"INTRA\",E451)),AW451,IF(ISNUMBER(SEARCH(\"FUT\",E451)),BE451,BM451)))","v":""},"",null,"","","","","",{"$f":"IF(G451&H451=\"\",\"\",ROUND(G451*H451*0.00015,2))","v":""},"",null,{"$f":"IF(MIN(20,((G451*H451*0.0003)))+MIN(20,((G451*H451*0.0003)))=0,\"\",MIN(20,((G451*H451*0.0003)))+MIN(20,((G451*H451*0.0003))))","v":""},{"$f":"IF(I451&G451=\"\",\"\",ROUND(I451*G451*0.00025,0))","v":""},"","","",{"$f":"IF(G451&H451=\"\",\"\",ROUND(G451*H451*0.00003,2))","v":""},"",null,{"$f":"IF(MIN(20,((G451*H451*0.0003)))+MIN(20,((G451*H451*0.0003)))=0,\"\",MIN(20,((G451*H451*0.0003)))+MIN(20,((G451*H451*0.0003))))","v":""},{"$f":"IF(I451&G451=\"\",\"\",ROUND(I451*G451*0.0001,0))","v":""},"","","",{"$f":"IF(G451&H451=\"\",\"\",ROUND(G451*H451*0.00002,2))","v":""},"",null,{"$f":"IF(AA451=\"\",\"\",40)","v":""},{"$f":"IF(I451&G451=\"\",\"\",ROUND(I451*G451*0.0005,0))","v":""},{"$f":"IF(AA451=\"\",\"\",ROUND(AA451*0.00053,2))","v":""},"",{"$f":"IF(AA451=\"\",\"\",ROUND((5/10000000)*AA451,2))","v":""},{"$f":"IF(G451&H451=\"\",\"\",ROUND(G451*H451*0.00003,2))","v":""},""]
[450,null,null,null,null,null,null,null,null,null,null,null,{"$f":"IF(OR(J452=\"\",K452=\"\"),\"\",IF(F452=\"Long\",  ((K452-H452)/(H452-J452)), ((I452-K452)/(J452-I452)) ))","v":""},{"$f":"IF(OR(I452=\"\",D452=\"\",H452=\"\",G452=\"\",E452=\"\",K452=\"\"),\"\",IF(I452=K452,\"Target Achieved\",IF(I452=J452,\"SL Hit\",IF(I452<J452,\"Extended SL Hit\",IF(I452>K452,\"Target Overachieved\",IF(AND(I452>=H452,I452<K452),\"Early Profit Exit\",\"Early Loss Exit\"))))))","v":""},{"$f":"IF(AA452=\"\",\"\",IF(OR(I452=\"\",H452=\"\"),0,G452*(I452-H452)))","v":""},{"$f":"IF(AH452=\"\",\"\",AH452)","v":""},"",{"$f":"IF(C452=\"\",\"\",IF(ISNUMBER(SEARCH(\"Start&End\",B452)),SUM(P452:INDEX(P452:P556,MATCH(TRUE,(B452:B556=\"Start&End\"),0))),SUM(P452:INDEX(P452:P556,MATCH(TRUE,(B452:B556=\"End\"),0)))))","v":""},{"$f":"IF(C452=\"\",\"\",IF(ISNUMBER(SEARCH(\"Start&End\",B452)),SUM(Q452:INDEX(Q452:Q556,MATCH(TRUE,(B452:B556=\"Start&End\"),0))),SUM(Q452:INDEX(Q452:Q556,MATCH(TRUE,(B452:B556=\"End\"),0)))))","v":""},{"$f":"IF(ISNUMBER(S452),S452,\"\")","v":""},null,null,null,null,null,null,"","","","","","","",{"$f":"IF(AB452&AC452&AD452&AE452&AF452&AG452=\"\",\"\",SUM(AB452:AG452))","v":""},null,{"$f":"IF(AA452=\"\",\"\",0)","v":""},{"$f":"IF(AA452=\"\",\"\",ROUND(AA452*0.001,2))","v":""},{"$f":"IF(AA452=\"\",\"\",ROUND(AA452*0.0000345,2))","v":""},{"$f":"IF(AJ452&AL452=\"\",\"\",ROUND((AJ452+AL452)*0.18,2))","v":""},{"$f":"IF(AA452=\"\",\"\",ROUND((5/10000000)*AA452,2))","v":""},"",{"$f":"IF(AK452&AL452&AM452&AN452&AO452=\"\",\"\",SUM(AK452:AO452))","v":""},null,"","",{"$f":"IF(AA452=\"\",\"\",ROUND(AA452*0.0000345,2))","v":""},{"$f":"IF(AR452&AT452=\"\",\"\",ROUND((AR452+AT452)*0.18,2))","v":""},{"$f":"IF(AA452=\"\",\"\",ROUND((5/10000000)*AA452,2))","v":""},"",{"$f":"IF(AR452&AS452&AT452&AU452&AV452&AW452=\"\",\"\",SUM(AR452:AW452))","v":""},null,"","",{"$f":"IF(AA452=\"\",\"\",ROUND(AA452*0.00002,2))","v":""},{"$f":"IF(AZ452&BB452=\"\",\"\",ROUND((AZ452+BB452)*0.18,2))","v":""},{"$f":"IF(AA452=\"\",\"\",ROUND((5/10000000)*AA452,2))","v":""},"","",null,"","","",{"$f":"IF(BH452&BJ452=\"\",\"\",ROUND((BH452+BJ452)*0.18,2))","v":""},"","",{"$f":"IF(BH452&BI452&BJ452&BK452&BL452&BM452=\"\",\"\",SUM(BH452:BM452))","v":""}]
[451,null,null,null,null,null,null,null,null,null,null,null,"","","","","",{"$f":"IF(C453=\"\",\"\",IF(ISNUMBER(SEARCH(\"Start&End\",B453)),SUM(P453:INDEX(P453:P557,MATCH(TRUE,(B453:B557=\"Start&End\"),0))),SUM(P453:INDEX(P453:P557,MATCH(TRUE,(B453:B557=\"End\"),0)))))","v":""},{"$f":"IF(C453=\"\",\"\",IF(ISNUMBER(SEARCH(\"Start&End\",B453)),SUM(Q453:INDEX(Q453:Q557,MATCH(TRUE,(B453:B557=\"Start&End\"),0))),SUM(Q453:INDEX(Q453:Q557,MATCH(TRUE,(B453:B557=\"End\"),0)))))","v":""},"",null,null,null,null,null,null,"","","","","","","","",null,"","","","","","","",null,"","","","","","","",null,"","","","","","",{"$f":"IF(FAX453&BA453&BB453&BC453&BD453&BE453=\"\",\"\",SUM(AZ453:BE453))","v":""},null,"","","","","","",""]
[452,null,null,null,null,null,null,null,null,null,null,null,"","","","","",{"$f":"IF(C454=\"\",\"\",IF(ISNUMBER(SEARCH(\"Start&End\",B454)),SUM(P454:INDEX(P454:P558,MATCH(TRUE,(B454:B558=\"Start&End\"),0))),SUM(P454:INDEX(P454:P558,MATCH(TRUE,(B454:B558=\"End\"),0)))))","v":""},{"$f":"IF(C454=\"\",\"\",IF(ISNUMBER(SEARCH(\"Start&End\",B454)),SUM(Q454:INDEX(Q454:Q558,MATCH(TRUE,(B454:B558=\"Start&End\"),0))),SUM(Q454:INDEX(Q454:Q558,MATCH(TRUE,(B454:B558=\"End\"),0)))))","v":""},"",null,null,null,null,null,null,"","","","","","","","",null,"","","","","","","",null,"","","","","","","",null,"","","","","","","",null,"","","","","","",""]
[453,null,null,null,null,null,null,null,null,null,null,null,"","","","","",{"$f":"IF(C455=\"\",\"\",IF(ISNUMBER(SEARCH(\"Start&End\",B455)),SUM(P455:INDEX(P455:P559,MATCH(TRUE,(B455:B559=\"Start&End\"),0))),SUM(P455:INDEX(P455:P559,MATCH(TRUE,(B455:B559=\"End\"),0)))))","v":""},{"$f":"IF(C455=\"\",\"\",IF(ISNUMBER(SEARCH(\"Start&End\",B455)),SUM(Q455:INDEX(Q455:Q559,MATCH(TRUE,(B455:B559=\"Start&End\"),0))),SUM(Q455:INDEX(Q455:Q559,MATCH(TRUE,(B455:B559=\"End\"),0)))))","v":""},"",null,null,null,null,null,null,"","","","","","","","",null,"","","","","","","",null,"","","","","","","",null,"","","","","","","",null,"","","","","","",""]
[454,null,null,null,null,null,null,null,null,null,null,null,"","","","","",{"$f":"IF(C456=\"\",\"\",IF(ISNUMBER(SEARCH(\"Start&End\",B456)),SUM(P456:INDEX(P456:P560,MATCH(TRUE,(B456:B560=\"Start&End\"),0))),SUM(P456:INDEX(P456:P560,MATCH(TRUE,(B456:B560=\"End\"),0)))))","v":""},{"$f":"IF(C456=\"\",\"\",IF(ISNUMBER(SEARCH(\"Start&End\",B456)),SUM(Q456:INDEX(Q456:Q560,MATCH(TRUE,(B456:B560=\"Start&End\"),0))),SUM(Q456:INDEX(Q456:Q560,MATCH(TRUE,(B456:B560=\"End\"),0)))))","v":""},"",null,null,null,null,null,null,"","","","","","","","",null,"","","","","","","",null,"","","","","","","",null,"","","","","","","",null,"","","","","","",""]
[455,null,null,null,null,null,null,null,null,null,null,null,"","","","","",{"$f":"IF(C457=\"\",\"\",IF(ISNUMBER(SEARCH(\"Start&End\",B457)),SUM(P457:INDEX(P457:P561,MATCH(TRUE,(B457:B561=\"Start&End\"),0))),SUM(P457:INDEX(P457:P561,MATCH(TRUE,(B457:B561=\"End\"),0)))))","v":""},{"$f":"IF(C457=\"\",\"\",IF(ISNUMBER(SEARCH(\"Start&End\",B457)),SUM(Q457:INDEX(Q457:Q561,MATCH(TRUE,(B457:B561=\"Start&End\"),0))),SUM(Q457:INDEX(Q457:Q561,MATCH(TRUE,(B457:B561=\"End\"),0)))))","v":""},"",null,null,null,null,null,null,"","","","","","","","",null,"","","","","","","",null,"","","","","","","",null,"","","","","","","",null,"","","","","","",""]
[456,null,null,null,null,null,null,null,null,null,null,null,"","","","","",{"$f":"IF(C458=\"\",\"\",IF(ISNUMBER(SEARCH(\"Start&End\",B458)),SUM(P458:INDEX(P458:P562,MATCH(TRUE,(B458:B562=\"Start&End\"),0))),SUM(P458:INDEX(P458:P562,MATCH(TRUE,(B458:B562=\"End\"),0)))))","v":""},{"$f":"IF(C458=\"\",\"\",IF(ISNUMBER(SEARCH(\"Start&End\",B458)),SUM(Q458:INDEX(Q458:Q562,MATCH(TRUE,(B458:B562=\"Start&End\"),0))),SUM(Q458:INDEX(Q458:Q562,MATCH(TRUE,(B458:B562=\"End\"),0)))))","v":""},"",null,null,null,null,null,null,"","","","","","","","",null,"","","","","","","",null,"","","","","","","",null,"","","","","","","",null,"","","","","","",""]
[457,null,null,null,null,null,null,null,null,null,null,null,"","","","","",{"$f":"IF(C459=\"\",\"\",IF(ISNUMBER(SEARCH(\"Start&End\",B459)),SUM(P459:INDEX(P459:P563,MATCH(TRUE,(B459:B563=\"Start&End\"),0))),SUM(P459:INDEX(P459:P563,MATCH(TRUE,(B459:B563=\"End\"),0)))))","v":""},{"$f":"IF(C459=\"\",\"\",IF(ISNUMBER(SEARCH(\"Start&End\",B459)),SUM(Q459:INDEX(Q459:Q563,MATCH(TRUE,(B459:B563=\"Start&End\"),0))),SUM(Q459:INDEX(Q459:Q563,MATCH(TRUE,(B459:B563=\"End\"),0)))))","v":""},"",null,null,null,null,null,null,"","","","","","","","",null,"","","","","","","",null,"","","","","","","",null,"","","","","","","",null,"","","","","","",""]
[458,null,null,null,null,null,null,null,null,null,null,null,"","","","","",{"$f":"IF(C460=\"\",\"\",IF(ISNUMBER(SEARCH(\"Start&End\",B460)),SUM(P460:INDEX(P460:P564,MATCH(TRUE,(B460:B564=\"Start&End\"),0))),SUM(P460:INDEX(P460:P564,MATCH(TRUE,(B460:B564=\"End\"),0)))))","v":""},{"$f":"IF(C460=\"\",\"\",IF(ISNUMBER(SEARCH(\"Start&End\",B460)),SUM(Q460:INDEX(Q460:Q564,MATCH(TRUE,(B460:B564=\"Start&End\"),0))),SUM(Q460:INDEX(Q460:Q564,MATCH(TRUE,(B460:B564=\"End\"),0)))))","v":""},"",null,null,null,null,null,null,"","","","","","","","",null,"","","","","","","",null,"","","","","","","",null,"","","","","","","",null,"","","","","","",""]
[459,null,null,null,null,null,null,null,null,null,null,null,"","","","","",{"$f":"IF(C461=\"\",\"\",IF(ISNUMBER(SEARCH(\"Start&End\",B461)),SUM(P461:INDEX(P461:P565,MATCH(TRUE,(B461:B565=\"Start&End\"),0))),SUM(P461:INDEX(P461:P565,MATCH(TRUE,(B461:B565=\"End\"),0)))))","v":""},{"$f":"IF(C461=\"\",\"\",IF(ISNUMBER(SEARCH(\"Start&End\",B461)),SUM(Q461:INDEX(Q461:Q565,MATCH(TRUE,(B461:B565=\"Start&End\"),0))),SUM(Q461:INDEX(Q461:Q565,MATCH(TRUE,(B461:B565=\"End\"),0)))))","v":""},"",null,null,null,null,null,null,"","","","","","","","",null,"","","","","","","",null,"","","","","","","",null,"","","","","","","",null,"","","","","","",""]
[460,null,null,null,null,null,null,null,null,null,null,null,"","","","","",{"$f":"IF(C462=\"\",\"\",IF(ISNUMBER(SEARCH(\"Start&End\",B462)),SUM(P462:INDEX(P462:P566,MATCH(TRUE,(B462:B566=\"Start&End\"),0))),SUM(P462:INDEX(P462:P566,MATCH(TRUE,(B462:B566=\"End\"),0)))))","v":""},{"$f":"IF(C462=\"\",\"\",IF(ISNUMBER(SEARCH(\"Start&End\",B462)),SUM(Q462:INDEX(Q462:Q566,MATCH(TRUE,(B462:B566=\"Start&End\"),0))),SUM(Q462:INDEX(Q462:Q566,MATCH(TRUE,(B462:B566=\"End\"),0)))))","v":""},"",null,null,null,null,null,null,"","","","","","","","",null,"","","","","","","",null,"","","","","","","",null,"","","","","","","",null,"","","","","","",""]
[461,null,null,null,null,null,null,null,null,null,null,null,"","","","","",{"$f":"IF(C463=\"\",\"\",IF(ISNUMBER(SEARCH(\"Start&End\",B463)),SUM(P463:INDEX(P463:P567,MATCH(TRUE,(B463:B567=\"Start&End\"),0))),SUM(P463:INDEX(P463:P567,MATCH(TRUE,(B463:B567=\"End\"),0)))))","v":""},{"$f":"IF(C463=\"\",\"\",IF(ISNUMBER(SEARCH(\"Start&End\",B463)),SUM(Q463:INDEX(Q463:Q567,MATCH(TRUE,(B463:B567=\"Start&End\"),0))),SUM(Q463:INDEX(Q463:Q567,MATCH(TRUE,(B463:B567=\"End\"),0)))))","v":""},"",null,null,null,null,null,null,"","","","","","","","",null,"","","","","","","",null,"","","","","","","",null,"","","","","","","",null,"","","","","","",""]
[462,null,null,null,null,null,null,null,null,null,null,null,"","","","","",{"$f":"IF(C464=\"\",\"\",IF(ISNUMBER(SEARCH(\"Start&End\",B464)),SUM(P464:INDEX(P464:P568,MATCH(TRUE,(B464:B568=\"Start&End\"),0))),SUM(P464:INDEX(P464:P568,MATCH(TRUE,(B464:B568=\"End\"),0)))))","v":""},{"$f":"IF(C464=\"\",\"\",IF(ISNUMBER(SEARCH(\"Start&End\",B464)),SUM(Q464:INDEX(Q464:Q568,MATCH(TRUE,(B464:B568=\"Start&End\"),0))),SUM(Q464:INDEX(Q464:Q568,MATCH(TRUE,(B464:B568=\"End\"),0)))))","v":""},"",null,null,null,null,null,null,"","","","","","","","",null,"","","","","","","",null,"","","","","","","",null,"","","","","","","",null,"","","","","","",""]
[463,null,null,null,null,null,null,null,null,null,null,null,"","","","","",{"$f":"IF(C465=\"\",\"\",IF(ISNUMBER(SEARCH(\"Start&End\",B465)),SUM(P465:INDEX(P465:P569,MATCH(TRUE,(B465:B569=\"Start&End\"),0))),SUM(P465:INDEX(P465:P569,MATCH(TRUE,(B465:B569=\"End\"),0)))))","v":""},{"$f":"IF(C465=\"\",\"\",IF(ISNUMBER(SEARCH(\"Start&End\",B465)),SUM(Q465:INDEX(Q465:Q569,MATCH(TRUE,(B465:B569=\"Start&End\"),0))),SUM(Q465:INDEX(Q465:Q569,MATCH(TRUE,(B465:B569=\"End\"),0)))))","v":""},"",null,null,null,null,null,null,"","","","","","","","",null,"","","","","","","",null,"","","","","","","",null,"","","","","","","",null,"","","","","","",""]
[464,null,null,null,null,null,null,null,null,null,null,null,"","","","","",{"$f":"IF(C466=\"\",\"\",IF(ISNUMBER(SEARCH(\"Start&End\",B466)),SUM(P466:INDEX(P466:P570,MATCH(TRUE,(B466:B570=\"Start&End\"),0))),SUM(P466:INDEX(P466:P570,MATCH(TRUE,(B466:B570=\"End\"),0)))))","v":""},{"$f":"IF(C466=\"\",\"\",IF(ISNUMBER(SEARCH(\"Start&End\",B466)),SUM(Q466:INDEX(Q466:Q570,MATCH(TRUE,(B466:B570=\"Start&End\"),0))),SUM(Q466:INDEX(Q466:Q570,MATCH(TRUE,(B466:B570=\"End\"),0)))))","v":""},"",null,null,null,null,null,null,"","","","","","","","",null,"","","","","","","",null,"","","","","","","",null,"","","","","","","",null,"","","","","","",""]
[465,null,null,null,null,null,null,null,null,null,null,null,"","","","","",{"$f":"IF(C467=\"\",\"\",IF(ISNUMBER(SEARCH(\"Start&End\",B467)),SUM(P467:INDEX(P467:P571,MATCH(TRUE,(B467:B571=\"Start&End\"),0))),SUM(P467:INDEX(P467:P571,MATCH(TRUE,(B467:B571=\"End\"),0)))))","v":""},{"$f":"IF(C467=\"\",\"\",IF(ISNUMBER(SEARCH(\"Start&End\",B467)),SUM(Q467:INDEX(Q467:Q571,MATCH(TRUE,(B467:B571=\"Start&End\"),0))),SUM(Q467:INDEX(Q467:Q571,MATCH(TRUE,(B467:B571=\"End\"),0)))))","v":""},"",null,null,null,null,null,null,"","","","","","","","",null,"","","","","","","",null,"","","","","","","",null,"","","","","","","",null,"","","","","","",""]
[466,null,null,null,null,null,null,null,null,null,null,null,"","","","","",{"$f":"IF(C468=\"\",\"\",IF(ISNUMBER(SEARCH(\"Start&End\",B468)),SUM(P468:INDEX(P468:P572,MATCH(TRUE,(B468:B572=\"Start&End\"),0))),SUM(P468:INDEX(P468:P572,MATCH(TRUE,(B468:B572=\"End\"),0)))))","v":""},{"$f":"IF(C468=\"\",\"\",IF(ISNUMBER(SEARCH(\"Start&End\",B468)),SUM(Q468:INDEX(Q468:Q572,MATCH(TRUE,(B468:B572=\"Start&End\"),0))),SUM(Q468:INDEX(Q468:Q572,MATCH(TRUE,(B468:B572=\"End\"),0)))))","v":""},"",null,null,null,null,null,null,"","","","","","","","",null,"","","","","","","",null,"","","","","","","",null,"","","","","","","",null,"","","","","","",""]
[467,null,null,null,null,null,null,null,null,null,null,null,"","","","","",{"$f":"IF(C469=\"\",\"\",IF(ISNUMBER(SEARCH(\"Start&End\",B469)),SUM(P469:INDEX(P469:P573,MATCH(TRUE,(B469:B573=\"Start&End\"),0))),SUM(P469:INDEX(P469:P573,MATCH(TRUE,(B469:B573=\"End\"),0)))))","v":""},{"$f":"IF(C469=\"\",\"\",IF(ISNUMBER(SEARCH(\"Start&End\",B469)),SUM(Q469:INDEX(Q469:Q573,MATCH(TRUE,(B469:B573=\"Start&End\"),0))),SUM(Q469:INDEX(Q469:Q573,MATCH(TRUE,(B469:B573=\"End\"),0)))))","v":""},"",null,null,null,null,null,null,"","","","","","","","",null,"","","","","","","",null,"","","","","","","",null,"","","","","","","",null,"","","","","","",""]
[468,null,null,null,null,null,null,null,null,null,null,null,"","","","","",{"$f":"IF(C470=\"\",\"\",IF(ISNUMBER(SEARCH(\"Start&End\",B470)),SUM(P470:INDEX(P470:P574,MATCH(TRUE,(B470:B574=\"Start&End\"),0))),SUM(P470:INDEX(P470:P574,MATCH(TRUE,(B470:B574=\"End\"),0)))))","v":""},{"$f":"IF(C470=\"\",\"\",IF(ISNUMBER(SEARCH(\"Start&End\",B470)),SUM(Q470:INDEX(Q470:Q574,MATCH(TRUE,(B470:B574=\"Start&End\"),0))),SUM(Q470:INDEX(Q470:Q574,MATCH(TRUE,(B470:B574=\"End\"),0)))))","v":""},"",null,null,null,null,null,null,"","","","","","","","",null,"","","","","","","",null,"","","","","","","",null,"","","","","","","",null,"","","","","","",""]
[469,null,null,null,null,null,null,null,null,null,null,null,"","","","","",{"$f":"IF(C471=\"\",\"\",IF(ISNUMBER(SEARCH(\"Start&End\",B471)),SUM(P471:INDEX(P471:P575,MATCH(TRUE,(B471:B575=\"Start&End\"),0))),SUM(P471:INDEX(P471:P575,MATCH(TRUE,(B471:B575=\"End\"),0)))))","v":""},{"$f":"IF(C471=\"\",\"\",IF(ISNUMBER(SEARCH(\"Start&End\",B471)),SUM(Q471:INDEX(Q471:Q575,MATCH(TRUE,(B471:B575=\"Start&End\"),0))),SUM(Q471:INDEX(Q471:Q575,MATCH(TRUE,(B471:B575=\"End\"),0)))))","v":""},"",null,null,null,null,null,null,"","","","","","","","",null,"","","","","","","",null,"","","","","","","",null,"","","","","","","",null,"","","","","","",""]
[470,null,null,null,null,null,null,null,null,null,null,null,"","","","","",{"$f":"IF(C472=\"\",\"\",IF(ISNUMBER(SEARCH(\"Start&End\",B472)),SUM(P472:INDEX(P472:P576,MATCH(TRUE,(B472:B576=\"Start&End\"),0))),SUM(P472:INDEX(P472:P576,MATCH(TRUE,(B472:B576=\"End\"),0)))))","v":""},{"$f":"IF(C472=\"\",\"\",IF(ISNUMBER(SEARCH(\"Start&End\",B472)),SUM(Q472:INDEX(Q472:Q576,MATCH(TRUE,(B472:B576=\"Start&End\"),0))),SUM(Q472:INDEX(Q472:Q576,MATCH(TRUE,(B472:B576=\"End\"),0)))))","v":""},"",null,null,null,null,null,null,"","","","","","","","",null,"","","","","","","",null,"","","","","","","",null,"","","","","","","",null,"","","","","","",""]
[471,null,null,null,null,null,null,null,null,null,null,null,"","","","","",{"$f":"IF(C473=\"\",\"\",IF(ISNUMBER(SEARCH(\"Start&End\",B473)),SUM(P473:INDEX(P473:P577,MATCH(TRUE,(B473:B577=\"Start&End\"),0))),SUM(P473:INDEX(P473:P577,MATCH(TRUE,(B473:B577=\"End\"),0)))))","v":""},{"$f":"IF(C473=\"\",\"\",IF(ISNUMBER(SEARCH(\"Start&End\",B473)),SUM(Q473:INDEX(Q473:Q577,MATCH(TRUE,(B473:B577=\"Start&End\"),0))),SUM(Q473:INDEX(Q473:Q577,MATCH(TRUE,(B473:B577=\"End\"),0)))))","v":""},"",null,null,null,null,null,null,"","","","","","","","",null,"","","","","","","",null,"","","","","","","",null,"","","","","","","",null,"","","","","","",""]
[472,null,null,null,null,null,null,null,null,null,null,null,"","","","","",{"$f":"IF(C474=\"\",\"\",IF(ISNUMBER(SEARCH(\"Start&End\",B474)),SUM(P474:INDEX(P474:P578,MATCH(TRUE,(B474:B578=\"Start&End\"),0))),SUM(P474:INDEX(P474:P578,MATCH(TRUE,(B474:B578=\"End\"),0)))))","v":""},{"$f":"IF(C474=\"\",\"\",IF(ISNUMBER(SEARCH(\"Start&End\",B474)),SUM(Q474:INDEX(Q474:Q578,MATCH(TRUE,(B474:B578=\"Start&End\"),0))),SUM(Q474:INDEX(Q474:Q578,MATCH(TRUE,(B474:B578=\"End\"),0)))))","v":""},"",null,null,null,null,null,null,"","","","","","","","",null,"","","","","","","",null,"","","","","","","",null,"","","","","","","",null,"","","","","","",""]
[473,null,null,null,null,null,null,null,null,null,null,null,"","","","","",{"$f":"IF(C475=\"\",\"\",IF(ISNUMBER(SEARCH(\"Start&End\",B475)),SUM(P475:INDEX(P475:P579,MATCH(TRUE,(B475:B579=\"Start&End\"),0))),SUM(P475:INDEX(P475:P579,MATCH(TRUE,(B475:B579=\"End\"),0)))))","v":""},{"$f":"IF(C475=\"\",\"\",IF(ISNUMBER(SEARCH(\"Start&End\",B475)),SUM(Q475:INDEX(Q475:Q579,MATCH(TRUE,(B475:B579=\"Start&End\"),0))),SUM(Q475:INDEX(Q475:Q579,MATCH(TRUE,(B475:B579=\"End\"),0)))))","v":""},"",null,null,null,null,null,null,"","","","","","","","",null,"","","","","","","",null,"","","","","","","",null,"","","","","","","",null,"","","","","","",""]
[474,null,null,null,null,null,null,null,null,null,null,null,"","","","","",{"$f":"IF(C476=\"\",\"\",IF(ISNUMBER(SEARCH(\"Start&End\",B476)),SUM(P476:INDEX(P476:P580,MATCH(TRUE,(B476:B580=\"Start&End\"),0))),SUM(P476:INDEX(P476:P580,MATCH(TRUE,(B476:B580=\"End\"),0)))))","v":""},{"$f":"IF(C476=\"\",\"\",IF(ISNUMBER(SEARCH(\"Start&End\",B476)),SUM(Q476:INDEX(Q476:Q580,MATCH(TRUE,(B476:B580=\"Start&End\"),0))),SUM(Q476:INDEX(Q476:Q580,MATCH(TRUE,(B476:B580=\"End\"),0)))))","v":""},"",null,null,null,null,null,null,"","","","","","","","",null,"","","","","","","",null,"","","","","","","",null,"","","","","","","",null,"","","","","","",""]
[475,null,null,null,null,null,null,null,null,null,null,null,"","","","","",{"$f":"IF(C477=\"\",\"\",IF(ISNUMBER(SEARCH(\"Start&End\",B477)),SUM(P477:INDEX(P477:P581,MATCH(TRUE,(B477:B581=\"Start&End\"),0))),SUM(P477:INDEX(P477:P581,MATCH(TRUE,(B477:B581=\"End\"),0)))))","v":""},{"$f":"IF(C477=\"\",\"\",IF(ISNUMBER(SEARCH(\"Start&End\",B477)),SUM(Q477:INDEX(Q477:Q581,MATCH(TRUE,(B477:B581=\"Start&End\"),0))),SUM(Q477:INDEX(Q477:Q581,MATCH(TRUE,(B477:B581=\"End\"),0)))))","v":""},"",null,null,null,null,null,null,"","","","","","","","",null,"","","","","","","",null,"","","","","","","",null,"","","","","","","",null,"","","","","","",""]
[476,null,null,null,null,null,null,null,null,null,null,null,"","","","","",{"$f":"IF(C478=\"\",\"\",IF(ISNUMBER(SEARCH(\"Start&End\",B478)),SUM(P478:INDEX(P478:P582,MATCH(TRUE,(B478:B582=\"Start&End\"),0))),SUM(P478:INDEX(P478:P582,MATCH(TRUE,(B478:B582=\"End\"),0)))))","v":""},{"$f":"IF(C478=\"\",\"\",IF(ISNUMBER(SEARCH(\"Start&End\",B478)),SUM(Q478:INDEX(Q478:Q582,MATCH(TRUE,(B478:B582=\"Start&End\"),0))),SUM(Q478:INDEX(Q478:Q582,MATCH(TRUE,(B478:B582=\"End\"),0)))))","v":""},"",null,null,null,null,null,null,"","","","","","","","",null,"","","","","","","",null,"","","","","","","",null,"","","","","","","",null,"","","","","","",""]
[477,null,null,null,null,null,null,null,null,null,null,null,"","","","","",{"$f":"IF(C479=\"\",\"\",IF(ISNUMBER(SEARCH(\"Start&End\",B479)),SUM(P479:INDEX(P479:P583,MATCH(TRUE,(B479:B583=\"Start&End\"),0))),SUM(P479:INDEX(P479:P583,MATCH(TRUE,(B479:B583=\"End\"),0)))))","v":""},{"$f":"IF(C479=\"\",\"\",IF(ISNUMBER(SEARCH(\"Start&End\",B479)),SUM(Q479:INDEX(Q479:Q583,MATCH(TRUE,(B479:B583=\"Start&End\"),0))),SUM(Q479:INDEX(Q479:Q583,MATCH(TRUE,(B479:B583=\"End\"),0)))))","v":""},"",null,null,null,null,null,null,"","","","","","","","",null,"","","","","","","",null,"","","","","","","",null,"","","","","","","",null,"","","","","","",""]
[478,null,null,null,null,null,null,null,null,null,null,null,"","","","","",{"$f":"IF(C480=\"\",\"\",IF(ISNUMBER(SEARCH(\"Start&End\",B480)),SUM(P480:INDEX(P480:P584,MATCH(TRUE,(B480:B584=\"Start&End\"),0))),SUM(P480:INDEX(P480:P584,MATCH(TRUE,(B480:B584=\"End\"),0)))))","v":""},{"$f":"IF(C480=\"\",\"\",IF(ISNUMBER(SEARCH(\"Start&End\",B480)),SUM(Q480:INDEX(Q480:Q584,MATCH(TRUE,(B480:B584=\"Start&End\"),0))),SUM(Q480:INDEX(Q480:Q584,MATCH(TRUE,(B480:B584=\"End\"),0)))))","v":""},"",null,null,null,null,null,null,"","","","","","","","",null,"","","","","","","",null,"","","","","","","",null,"","","","","","","",null,"","","","","","",""]
[479,null,null,null,null,null,null,null,null,null,null,null,"","","","","",{"$f":"IF(C481=\"\",\"\",IF(ISNUMBER(SEARCH(\"Start&End\",B481)),SUM(P481:INDEX(P481:P585,MATCH(TRUE,(B481:B585=\"Start&End\"),0))),SUM(P481:INDEX(P481:P585,MATCH(TRUE,(B481:B585=\"End\"),0)))))","v":""},{"$f":"IF(C481=\"\",\"\",IF(ISNUMBER(SEARCH(\"Start&End\",B481)),SUM(Q481:INDEX(Q481:Q585,MATCH(TRUE,(B481:B585=\"Start&End\"),0))),SUM(Q481:INDEX(Q481:Q585,MATCH(TRUE,(B481:B585=\"End\"),0)))))","v":""},"",null,null,null,null,null,null,"","","","","","","","",null,"","","","","","","",null,"","","","","","","",null,"","","","","","","",null,"","","","","","",""]
[480,null,null,null,null,null,null,null,null,null,null,null,"","","","","",{"$f":"IF(C482=\"\",\"\",IF(ISNUMBER(SEARCH(\"Start&End\",B482)),SUM(P482:INDEX(P482:P586,MATCH(TRUE,(B482:B586=\"Start&End\"),0))),SUM(P482:INDEX(P482:P586,MATCH(TRUE,(B482:B586=\"End\"),0)))))","v":""},{"$f":"IF(C482=\"\",\"\",IF(ISNUMBER(SEARCH(\"Start&End\",B482)),SUM(Q482:INDEX(Q482:Q586,MATCH(TRUE,(B482:B586=\"Start&End\"),0))),SUM(Q482:INDEX(Q482:Q586,MATCH(TRUE,(B482:B586=\"End\"),0)))))","v":""},"",null,null,null,null,null,null,"","","","","","","","",null,"","","","","","","",null,"","","","","","","",null,"","","","","","","",null,"","","","","","",""]
[481,null,null,null,null,null,null,null,null,null,null,null,"","","","","",{"$f":"IF(C483=\"\",\"\",IF(ISNUMBER(SEARCH(\"Start&End\",B483)),SUM(P483:INDEX(P483:P587,MATCH(TRUE,(B483:B587=\"Start&End\"),0))),SUM(P483:INDEX(P483:P587,MATCH(TRUE,(B483:B587=\"End\"),0)))))","v":""},{"$f":"IF(C483=\"\",\"\",IF(ISNUMBER(SEARCH(\"Start&End\",B483)),SUM(Q483:INDEX(Q483:Q587,MATCH(TRUE,(B483:B587=\"Start&End\"),0))),SUM(Q483:INDEX(Q483:Q587,MATCH(TRUE,(B483:B587=\"End\"),0)))))","v":""},"",null,null,null,null,null,null,"","","","","","","","",null,"","","","","","","",null,"","","","","","","",null,"","","","","","","",null,"","","","","","",""]
[482,null,null,null,null,null,null,null,null,null,null,null,"","","","","",{"$f":"IF(C484=\"\",\"\",IF(ISNUMBER(SEARCH(\"Start&End\",B484)),SUM(P484:INDEX(P484:P588,MATCH(TRUE,(B484:B588=\"Start&End\"),0))),SUM(P484:INDEX(P484:P588,MATCH(TRUE,(B484:B588=\"End\"),0)))))","v":""},{"$f":"IF(C484=\"\",\"\",IF(ISNUMBER(SEARCH(\"Start&End\",B484)),SUM(Q484:INDEX(Q484:Q588,MATCH(TRUE,(B484:B588=\"Start&End\"),0))),SUM(Q484:INDEX(Q484:Q588,MATCH(TRUE,(B484:B588=\"End\"),0)))))","v":""},"",null,null,null,null,null,null,"","","","","","","","",null,"","","","","","","",null,"","","","","","","",null,"","","","","","","",null,"","","","","","",""]
[483,null,null,null,null,null,null,null,null,null,null,null,"","","","","",{"$f":"IF(C485=\"\",\"\",IF(ISNUMBER(SEARCH(\"Start&End\",B485)),SUM(P485:INDEX(P485:P589,MATCH(TRUE,(B485:B589=\"Start&End\"),0))),SUM(P485:INDEX(P485:P589,MATCH(TRUE,(B485:B589=\"End\"),0)))))","v":""},{"$f":"IF(C485=\"\",\"\",IF(ISNUMBER(SEARCH(\"Start&End\",B485)),SUM(Q485:INDEX(Q485:Q589,MATCH(TRUE,(B485:B589=\"Start&End\"),0))),SUM(Q485:INDEX(Q485:Q589,MATCH(TRUE,(B485:B589=\"End\"),0)))))","v":""},"",null,null,null,null,null,null,"","","","","","","","",null,"","","","","","","",null,"","","","","","","",null,"","","","","","","",null,"","","","","","",""]
[484,null,null,null,null,null,null,null,null,null,null,null,"","","","","",{"$f":"IF(C486=\"\",\"\",IF(ISNUMBER(SEARCH(\"Start&End\",B486)),SUM(P486:INDEX(P486:P590,MATCH(TRUE,(B486:B590=\"Start&End\"),0))),SUM(P486:INDEX(P486:P590,MATCH(TRUE,(B486:B590=\"End\"),0)))))","v":""},{"$f":"IF(C486=\"\",\"\",IF(ISNUMBER(SEARCH(\"Start&End\",B486)),SUM(Q486:INDEX(Q486:Q590,MATCH(TRUE,(B486:B590=\"Start&End\"),0))),SUM(Q486:INDEX(Q486:Q590,MATCH(TRUE,(B486:B590=\"End\"),0)))))","v":""},"",null,null,null,null,null,null,"","","","","","","","",null,"","","","","","","",null,"","","","","","","",null,"","","","","","","",null,"","","","","","",""]
[485,null,null,null,null,null,null,null,null,null,null,null,"","","","","",{"$f":"IF(C487=\"\",\"\",IF(ISNUMBER(SEARCH(\"Start&End\",B487)),SUM(P487:INDEX(P487:P591,MATCH(TRUE,(B487:B591=\"Start&End\"),0))),SUM(P487:INDEX(P487:P591,MATCH(TRUE,(B487:B591=\"End\"),0)))))","v":""},{"$f":"IF(C487=\"\",\"\",IF(ISNUMBER(SEARCH(\"Start&End\",B487)),SUM(Q487:INDEX(Q487:Q591,MATCH(TRUE,(B487:B591=\"Start&End\"),0))),SUM(Q487:INDEX(Q487:Q591,MATCH(TRUE,(B487:B591=\"End\"),0)))))","v":""},"",null,null,null,null,null,null,"","","","","","","","",null,"","","","","","","",null,"","","","","","","",null,"","","","","","","",null,"","","","","","",""]
[486,null,null,null,null,null,null,null,null,null,null,null,"","","","","",{"$f":"IF(C488=\"\",\"\",IF(ISNUMBER(SEARCH(\"Start&End\",B488)),SUM(P488:INDEX(P488:P592,MATCH(TRUE,(B488:B592=\"Start&End\"),0))),SUM(P488:INDEX(P488:P592,MATCH(TRUE,(B488:B592=\"End\"),0)))))","v":""},{"$f":"IF(C488=\"\",\"\",IF(ISNUMBER(SEARCH(\"Start&End\",B488)),SUM(Q488:INDEX(Q488:Q592,MATCH(TRUE,(B488:B592=\"Start&End\"),0))),SUM(Q488:INDEX(Q488:Q592,MATCH(TRUE,(B488:B592=\"End\"),0)))))","v":""},"",null,null,null,null,null,null,"","","","","","","","",null,"","","","","","","",null,"","","","","","","",null,"","","","","","","",null,"","","","","","",""]
[487,null,null,null,null,null,null,null,null,null,null,null,"","","","","",{"$f":"IF(C489=\"\",\"\",IF(ISNUMBER(SEARCH(\"Start&End\",B489)),SUM(P489:INDEX(P489:P593,MATCH(TRUE,(B489:B593=\"Start&End\"),0))),SUM(P489:INDEX(P489:P593,MATCH(TRUE,(B489:B593=\"End\"),0)))))","v":""},{"$f":"IF(C489=\"\",\"\",IF(ISNUMBER(SEARCH(\"Start&End\",B489)),SUM(Q489:INDEX(Q489:Q593,MATCH(TRUE,(B489:B593=\"Start&End\"),0))),SUM(Q489:INDEX(Q489:Q593,MATCH(TRUE,(B489:B593=\"End\"),0)))))","v":""},"",null,null,null,null,null,null,"","","","","","","","",null,"","","","","","","",null,"","","","","","","",null,"","","","","","","",null,"","","","","","",""]
[488,null,null,null,null,null,null,null,null,null,null,null,"","","","","",{"$f":"IF(C490=\"\",\"\",IF(ISNUMBER(SEARCH(\"Start&End\",B490)),SUM(P490:INDEX(P490:P594,MATCH(TRUE,(B490:B594=\"Start&End\"),0))),SUM(P490:INDEX(P490:P594,MATCH(TRUE,(B490:B594=\"End\"),0)))))","v":""},{"$f":"IF(C490=\"\",\"\",IF(ISNUMBER(SEARCH(\"Start&End\",B490)),SUM(Q490:INDEX(Q490:Q594,MATCH(TRUE,(B490:B594=\"Start&End\"),0))),SUM(Q490:INDEX(Q490:Q594,MATCH(TRUE,(B490:B594=\"End\"),0)))))","v":""},"",null,null,null,null,null,null,"","","","","","","","",null,"","","","","","","",null,"","","","","","","",null,"","","","","","","",null,"","","","","","",""]
[489,null,null,null,null,null,null,null,null,null,null,null,"","","","","",{"$f":"IF(C491=\"\",\"\",IF(ISNUMBER(SEARCH(\"Start&End\",B491)),SUM(P491:INDEX(P491:P595,MATCH(TRUE,(B491:B595=\"Start&End\"),0))),SUM(P491:INDEX(P491:P595,MATCH(TRUE,(B491:B595=\"End\"),0)))))","v":""},{"$f":"IF(C491=\"\",\"\",IF(ISNUMBER(SEARCH(\"Start&End\",B491)),SUM(Q491:INDEX(Q491:Q595,MATCH(TRUE,(B491:B595=\"Start&End\"),0))),SUM(Q491:INDEX(Q491:Q595,MATCH(TRUE,(B491:B595=\"End\"),0)))))","v":""},"",null,null,null,null,null,null,"","","","","","","","",null,"","","","","","","",null,"","","","","","","",null,"","","","","","","",null,"","","","","","",""]
[490,null,null,null,null,null,null,null,null,null,null,null,"","","","","",{"$f":"IF(C492=\"\",\"\",IF(ISNUMBER(SEARCH(\"Start&End\",B492)),SUM(P492:INDEX(P492:P596,MATCH(TRUE,(B492:B596=\"Start&End\"),0))),SUM(P492:INDEX(P492:P596,MATCH(TRUE,(B492:B596=\"End\"),0)))))","v":""},{"$f":"IF(C492=\"\",\"\",IF(ISNUMBER(SEARCH(\"Start&End\",B492)),SUM(Q492:INDEX(Q492:Q596,MATCH(TRUE,(B492:B596=\"Start&End\"),0))),SUM(Q492:INDEX(Q492:Q596,MATCH(TRUE,(B492:B596=\"End\"),0)))))","v":""},"",null,null,null,null,null,null,"","","","","","","","",null,"","","","","","","",null,"","","","","","","",null,"","","","","","","",null,"","","","","","",""]
[491,null,null,null,null,null,null,null,null,null,null,null,"","","","","",{"$f":"IF(C493=\"\",\"\",IF(ISNUMBER(SEARCH(\"Start&End\",B493)),SUM(P493:INDEX(P493:P597,MATCH(TRUE,(B493:B597=\"Start&End\"),0))),SUM(P493:INDEX(P493:P597,MATCH(TRUE,(B493:B597=\"End\"),0)))))","v":""},{"$f":"IF(C493=\"\",\"\",IF(ISNUMBER(SEARCH(\"Start&End\",B493)),SUM(Q493:INDEX(Q493:Q597,MATCH(TRUE,(B493:B597=\"Start&End\"),0))),SUM(Q493:INDEX(Q493:Q597,MATCH(TRUE,(B493:B597=\"End\"),0)))))","v":""},"",null,null,null,null,null,null,"","","","","","","","",null,"","","","","","","",null,"","","","","","","",null,"","","","","","","",null,"","","","","","",""]
[492,null,null,null,null,null,null,null,null,null,null,null,"","","","","",{"$f":"IF(C494=\"\",\"\",IF(ISNUMBER(SEARCH(\"Start&End\",B494)),SUM(P494:INDEX(P494:P598,MATCH(TRUE,(B494:B598=\"Start&End\"),0))),SUM(P494:INDEX(P494:P598,MATCH(TRUE,(B494:B598=\"End\"),0)))))","v":""},{"$f":"IF(C494=\"\",\"\",IF(ISNUMBER(SEARCH(\"Start&End\",B494)),SUM(Q494:INDEX(Q494:Q598,MATCH(TRUE,(B494:B598=\"Start&End\"),0))),SUM(Q494:INDEX(Q494:Q598,MATCH(TRUE,(B494:B598=\"End\"),0)))))","v":""},"",null,null,null,null,null,null,"","","","","","","","",null,"","","","","","","",null,"","","","","","","",null,"","","","","","","",null,"","","","","","",""]
[493,null,null,null,null,null,null,null,null,null,null,null,"","","","","",{"$f":"IF(C495=\"\",\"\",IF(ISNUMBER(SEARCH(\"Start&End\",B495)),SUM(P495:INDEX(P495:P599,MATCH(TRUE,(B495:B599=\"Start&End\"),0))),SUM(P495:INDEX(P495:P599,MATCH(TRUE,(B495:B599=\"End\"),0)))))","v":""},{"$f":"IF(C495=\"\",\"\",IF(ISNUMBER(SEARCH(\"Start&End\",B495)),SUM(Q495:INDEX(Q495:Q599,MATCH(TRUE,(B495:B599=\"Start&End\"),0))),SUM(Q495:INDEX(Q495:Q599,MATCH(TRUE,(B495:B599=\"End\"),0)))))","v":""},"",null,null,null,null,null,null,"","","","","","","","",null,"","","","","","","",null,"","","","","","","",null,"","","","","","","",null,"","","","","","",""]
[494,null,null,null,null,null,null,null,null,null,null,null,"","","","","",{"$f":"IF(C496=\"\",\"\",IF(ISNUMBER(SEARCH(\"Start&End\",B496)),SUM(P496:INDEX(P496:P600,MATCH(TRUE,(B496:B600=\"Start&End\"),0))),SUM(P496:INDEX(P496:P600,MATCH(TRUE,(B496:B600=\"End\"),0)))))","v":""},{"$f":"IF(C496=\"\",\"\",IF(ISNUMBER(SEARCH(\"Start&End\",B496)),SUM(Q496:INDEX(Q496:Q600,MATCH(TRUE,(B496:B600=\"Start&End\"),0))),SUM(Q496:INDEX(Q496:Q600,MATCH(TRUE,(B496:B600=\"End\"),0)))))","v":""},"",null,null,null,null,null,null,"","","","","","","","",null,"","","","","","","",null,"","","","","","","",null,"","","","","","","",null,"","","","","","",""]
[495,null,null,null,null,null,null,null,null,null,null,null,"","","","","",{"$f":"IF(C497=\"\",\"\",IF(ISNUMBER(SEARCH(\"Start&End\",B497)),SUM(P497:INDEX(P497:P601,MATCH(TRUE,(B497:B601=\"Start&End\"),0))),SUM(P497:INDEX(P497:P601,MATCH(TRUE,(B497:B601=\"End\"),0)))))","v":""},{"$f":"IF(C497=\"\",\"\",IF(ISNUMBER(SEARCH(\"Start&End\",B497)),SUM(Q497:INDEX(Q497:Q601,MATCH(TRUE,(B497:B601=\"Start&End\"),0))),SUM(Q497:INDEX(Q497:Q601,MATCH(TRUE,(B497:B601=\"End\"),0)))))","v":""},"",null,null,null,null,null,null,"","","","","","","","",null,"","","","","","","",null,"","","","","","","",null,"","","","","","","",null,"","","","","","",""]
[496,null,null,null,null,null,null,null,null,null,null,null,"","","","","",{"$f":"IF(C498=\"\",\"\",IF(ISNUMBER(SEARCH(\"Start&End\",B498)),SUM(P498:INDEX(P498:P602,MATCH(TRUE,(B498:B602=\"Start&End\"),0))),SUM(P498:INDEX(P498:P602,MATCH(TRUE,(B498:B602=\"End\"),0)))))","v":""},{"$f":"IF(C498=\"\",\"\",IF(ISNUMBER(SEARCH(\"Start&End\",B498)),SUM(Q498:INDEX(Q498:Q602,MATCH(TRUE,(B498:B602=\"Start&End\"),0))),SUM(Q498:INDEX(Q498:Q602,MATCH(TRUE,(B498:B602=\"End\"),0)))))","v":""},"",null,null,null,null,null,null,"","","","","","","","",null,"","","","","","","",null,"","","","","","","",null,"","","","","","","",null,"","","","","","",""]
[497,null,null,null,null,null,null,null,null,null,null,null,"","","","","",{"$f":"IF(C499=\"\",\"\",IF(ISNUMBER(SEARCH(\"Start&End\",B499)),SUM(P499:INDEX(P499:P603,MATCH(TRUE,(B499:B603=\"Start&End\"),0))),SUM(P499:INDEX(P499:P603,MATCH(TRUE,(B499:B603=\"End\"),0)))))","v":""},{"$f":"IF(C499=\"\",\"\",IF(ISNUMBER(SEARCH(\"Start&End\",B499)),SUM(Q499:INDEX(Q499:Q603,MATCH(TRUE,(B499:B603=\"Start&End\"),0))),SUM(Q499:INDEX(Q499:Q603,MATCH(TRUE,(B499:B603=\"End\"),0)))))","v":""},"",null,null,null,null,null,null,"","","","","","","","",null,"","","","","","","",null,"","","","","","","",null,"","","","","","","",null,"","","","","","",""]
[498,null,null,null,null,null,null,null,null,null,null,null,"","","","","",{"$f":"IF(C500=\"\",\"\",IF(ISNUMBER(SEARCH(\"Start&End\",B500)),SUM(P500:INDEX(P500:P604,MATCH(TRUE,(B500:B604=\"Start&End\"),0))),SUM(P500:INDEX(P500:P604,MATCH(TRUE,(B500:B604=\"End\"),0)))))","v":""},{"$f":"IF(C500=\"\",\"\",IF(ISNUMBER(SEARCH(\"Start&End\",B500)),SUM(Q500:INDEX(Q500:Q604,MATCH(TRUE,(B500:B604=\"Start&End\"),0))),SUM(Q500:INDEX(Q500:Q604,MATCH(TRUE,(B500:B604=\"End\"),0)))))","v":""},"",null,null,null,null,null,null,"","","","","","","","",null,"","","","","","","",null,"","","","","","","",null,"","","","","","","",null,"","","","","","",""]
[499,null,null,null,null,null,null,null,null,null,null,null,"","","","","",{"$f":"IF(C501=\"\",\"\",IF(ISNUMBER(SEARCH(\"Start&End\",B501)),SUM(P501:INDEX(P501:P605,MATCH(TRUE,(B501:B605=\"Start&End\"),0))),SUM(P501:INDEX(P501:P605,MATCH(TRUE,(B501:B605=\"End\"),0)))))","v":""},{"$f":"IF(C501=\"\",\"\",IF(ISNUMBER(SEARCH(\"Start&End\",B501)),SUM(Q501:INDEX(Q501:Q605,MATCH(TRUE,(B501:B605=\"Start&End\"),0))),SUM(Q501:INDEX(Q501:Q605,MATCH(TRUE,(B501:B605=\"End\"),0)))))","v":""},"",null,null,null,null,null,null,"","","","","","","","",null,"","","","","","","",null,"","","","","","","",null,"","","","","","","",null,"","","","","","",""]
[500,null,null,null,null,null,null,null,null,null,null,null,"","","","","",{"$f":"IF(C502=\"\",\"\",IF(ISNUMBER(SEARCH(\"Start&End\",B502)),SUM(P502:INDEX(P502:P606,MATCH(TRUE,(B502:B606=\"Start&End\"),0))),SUM(P502:INDEX(P502:P606,MATCH(TRUE,(B502:B606=\"End\"),0)))))","v":""},{"$f":"IF(C502=\"\",\"\",IF(ISNUMBER(SEARCH(\"Start&End\",B502)),SUM(Q502:INDEX(Q502:Q606,MATCH(TRUE,(B502:B606=\"Start&End\"),0))),SUM(Q502:INDEX(Q502:Q606,MATCH(TRUE,(B502:B606=\"End\"),0)))))","v":""},"",null,null,null,null,null,null,"","","","","","","","",null,"","","","","","","",null,"","","","","","","",null,"","","","","","","",null,"","","","","","",""]

{"sheet":"Dashboard","index":1,"n_rows":28,"n_cols":19,"rows_kept":28,"cut":false,"hidden":false,"merged":[[6,2,7,2],[1,1,2,21],[12,6,13,8],[12,10,13,12],[14,6,15,8],[14,10,15,12],[8,6,9,8],[8,18,9,20],[8,14,9,16],[8,10,9,12],[6,3,7,4],[6,6,7,8],[6,10,7,12],[6,14,7,16],[6,18,7,20],[18,6,19,8],[18,10,19,12],[20,6,21,8],[20,10,21,12],[12,18,13,20],[14,18,15,20],[12,14,13,16],[14,14,15,16],[18,14,19,16],[20,14,21,16],[18,18,19,20],[20,18,21,20]]}
[]
[null,"PERFORMANCE DASHBOARD"]
[]
[]
[]
[]
[null,null,"Sr.no","METRICS",null,null,"Winning Rate/Trade",null,null,null,"Losing Rate/Trade",null,null,null,"P&L/Trade Ratio",null,null,null,"Max Profit Daywise"]
[]
[null,null,1,"Net Profit/Loss",{"$f":"'Trading Zone'!W3","v":51.47},null,{"$f":"E13/E12","v":1},null,null,null,{"$f":"E14/E12","v":0},null,null,null,{"$f":"IF((E13+E14)>0,E9/(E13+E14),0)","v":51.47},null,null,null,{"$f":"IF(_xlfn.AGGREGATE(4,6,'Trading Zone'!S:S)>0,_xlfn.AGGREGATE(4,6,'Trading Zone'!S:S),\"No Profit\")","v":"No Profit"}]
[null,null,2,"Max Profitable Trade",{"$f":"IF(MAX('Trading Zone'!Q:Q)>0,MAX('Trading Zone'!Q:Q),\"No Profit\")","v":51.47}]
[null,null,3,"Max Losing trade",{"$f":"IF(MIN('Trading Zone'!Q:Q)<0,MIN('Trading Zone'!Q:Q),\"No Loss\")","v":"No Loss"}]
[null,null,4,"Total Trades",{"$f":"COUNT('Trading Zone'!D3:D500)","v":1}]
[null,null,5,"Total Winning Trades",{"$f":"COUNTIF('Trading Zone'!Q3:Q502,\">0\")","v":1},null,"Winning Rate/Day",null,null,null,"Losing Rate/Day",null,null,null,"P&L/Day Ratio",null,null,null,"Max Loss Daywise"]
[null,null,6,"Total Losing Trades",{"$f":"COUNTIF('Trading Zone'!Q3:Q502,\"<0\")","v":0}]
[null,null,7,"Pending Trades",{"$f":"E12-E13-E14","v":0},null,{"$f":"E19/E18","v":0},null,null,null,{"$f":"E20/E18","v":0},null,null,null,{"$f":"IF((E19+E20)>0,E9/(E19+E20),0)","v":0},null,null,null,{"$f":"IF(_xlfn.AGGREGATE(5,6,'Trading Zone'!S:S)<0,_xlfn.AGGREGATE(5,6,'Trading Zone'!S:S),\"No Loss\")","v":"No Loss"}]
[null,null,8,"Total Turnover",{"$f":"SUM('Trading Zone'!AA3:AA502)","v":501}]
[null,null,9,"Total Brokerage",{"$f":"'Trading Zone'!V3","v":47.53}]
[null,null,10,"Total Trading Days",{"$f":"COUNT('Trading Zone'!C3:C502)","v":1}]
[null,null,11,"Total Winning Days",{"$f":"COUNTIF('Trading Zone'!S3:S502,\">0\")","v":0},null,"Invested Capital",null,null,null,"Current Capital",null,null,null,"Total Withdrawal",null,null,null,"Total Funds Added"]
[null,null,12,"Total Losing Days",{"$f":"COUNTIF('Trading Zone'!S3:S502,\"<0\")","v":0}]
[null,null,null,null,null,null,{"$f":"'Trading Zone'!X3","v":15000},null,null,null,{"$f":"'Trading Zone'!Y3","v":15051.47},null,null,null,{"$f":"SUM('Trading Zone'!Y7:Y502)","v":0},null,null,null,{"$f":"SUM('Trading Zone'!W7:W502)","v":15000}]
[]
[]
[]
[]
[]
[]
[null,null,null,null,null,null,null,null,null,null,null,null,null,null,null,null,null,null," "]

{"sheet":"Goals & Target","index":2,"n_rows":22,"n_cols":15,"rows_kept":22,"cut":false,"hidden":false,"merged":[[1,1,2,17],[19,6,20,8],[21,6,22,8],[7,2,8,4],[14,2,15,4],[7,6,8,8],[14,10,15,12],[12,10,13,12],[12,14,13,16],[14,14,15,16],[7,10,8,12],[5,2,6,4],[12,2,13,4],[5,6,6,8],[5,10,6,12],[5,14,6,16],[7,14,8,16],[19,10,20,12],[21,10,22,12],[12,6,13,8],[14,6,15,8]]}
[]
[null,"TIME AND TARGET"]
[]
[]
[null,{"$f":"NOW()","v":"2021-04-22T05:56:25.690"}]
[null,null,"Invested Capital",null,null,null,"Target  Capital",null,null,null,"Target  Capital (%)",null,null,null,"Pending Target (%)"]
[]
[null,null,{"$f":"'Trading Zone'!X3","v":15000},null,null,null,300000,null,null,null,{"$f":"G8/C8*100-100","v":1900},null,null,null,{"$f":"G8/C15*100-100","v":1893.1608009051608}]
[]
[]
[]
[]
[null,null,"Current Capital",null,null,null,"Target  Progress",null,null,null,"Current Returns (%)",null,null,null,"Pending Target Capt."]
[]
[null,"D",{"$f":"'Trading Zone'!Y3","v":15051.47},null,null,null,{"$f":"'Trading Zone'!W3","v":51.47},null,null,null,{"$f":"C15/C8*100-100","v":0.34313333333332707},null,null,null,{"$f":"G8-C15","v":284948.53000000003}]
[]
[]
[]
[]
[null,null,null,null,null,null,"Trading Time",null,null,null,"Return per day(%)"]
[]
[null,null,null,null,null,null,{"$f":"DATEDIF('Trading Zone'!C3,NOW(),\"D\")+1","v":15},null,null,null,{"$f":"(C15/C8*100-100)/G22","v":2.2875555555555139E-2}]

{"sheet":"Option Writing Plan","index":3,"n_rows":26,"n_cols":17,"rows_kept":26,"cut":false,"hidden":false,"merged":[]}
["No of Lots","BNF Quantity","Nifty Quantity","Weekly profit","Capital size","Next Lot Time in weeks","Time Spent"," Profit","Revised Cap","Return/ week","Return/Lot","Final %","Brokerage","Progress","Goal Status"]
[{"$f":"ROUNDDOWN(E2/90000,0)","v":1},{"$f":"A2*25","v":25},{"$f":"A2*75","v":75},10000,93774.74,{"$f":"ROUNDUP(90000/D2,0)","v":9},{"$f":"F2","v":9},{"$f":"D2*F2","v":90000},{"$f":"H2+E2","v":183774.74},{"$f":"D2/E2*100","v":10.663852547071844},{"$f":"H2/E2*100","v":95.974672923646594},{"$f":"I2/90000*100-100","v":104.19415555555554},{"$f":"40+A2*24","v":64},0,{"$f":"IF(N2>H2,\"Completed\",\"Pending\")","v":"Pending"}]
[{"$f":"ROUNDDOWN(E3/90000,0)","v":2},{"$f":"A3*25","v":50},{"$f":"A3*75","v":150},{"$f":"A3*10000","v":20000},{"$f":"I2","v":183774.74},{"$f":"ROUNDUP(90000/D3,0)","v":5},{"$f":"G2+F3","v":14},{"$f":"D3*F3","v":100000},{"$f":"H3+E3","v":283774.74},{"$f":"D3/E3*100","v":10.882888475314942},{"$f":"H3/E3*100","v":54.414442376574712},{"$f":"I3/90000*100-100","v":215.30526666666663},{"$f":"40+A3*24","v":88},null,{"$f":"IF(N3>H3,\"Completed\",\"Pending\")","v":"Pending"}]
[3,75,225,{"$f":"A4*10000","v":30000},{"$f":"I3","v":283774.74},3,{"$f":"G3+F4","v":17},90000,373774.74,10.571765478491848,31.715296435475548,315.30526666666663,112,null,"Pending"]
[4,100,300,40000,373774.74,3,20,120000,493774.74,10.701632753460013,32.10489826038004,448.6386,136,null,"Pending"]
[5,125,375,50000,493774.74,2,22,100000,593774.74,10.126074898039539,20.252149796079078,559.74971111111108,160,null,"Pending"]
[6,150,450,60000,593774.74,2,24,120000,713774.74,10.104842115715465,20.209684231430931,693.08304444444445,184,null,"Pending","Total Trading weeks",{"$f":"SUM(F2:F53)","v":44}]
[7,175,525,70000,713774.74,2,26,140000,853774.74,9.8070155858975898,19.61403117179518,848.6386,208,null,"Pending","Trading Days",{"$f":"Q7*5","v":220}]
[9,225,675,90000,853774.74,1,27,90000,943774.74,10.541422202301277,10.541422202301277,948.6386,256,null,"Pending"]
[10,250,750,100000,943774.74,1,28,100000,1043774.74,10.595748727074429,10.595748727074429,1059.7497111111111,280,null,"Pending","Weekly Points Nifty",{"$f":"D2/(75*A2)+1","v":134.33333333333334}]
[11,275,825,110000,1043774.74,1,29,110000,1153774.74,10.538672357600836,10.538672357600836,1181.9719333333333,304,null,"Pending"]
[12,300,900,120000,1153774.74,1,30,120000,1273774.74,10.400643716640911,10.400643716640911,1315.3052666666667,328,null,"Pending","Daily Points Nifty",{"$f":"(Q10/5)+1","v":27.866666666666667}]
[14,350,1050,140000,1273774.74,1,31,140000,1413774.74,10.990954334673022,10.990954334673022,1470.8608222222222,376,null,"Pending"]
[15,375,1125,150000,1413774.74,1,32,150000,1563774.74,10.609893907143935,10.609893907143935,1637.5274888888889,400,null,"Pending","Weekly Points BNF",{"$f":"D2/(25*A2)+3","v":403}]
[17,425,1275,170000,1563774.74,1,33,170000,1733774.74,10.871130966087865,10.871130966087865,1826.4163777777778,448,null,"Pending"]
[19,475,1425,190000,1733774.74,1,34,190000,1923774.74,10.958747732130416,10.958747732130416,2037.5274888888889,496,null,"Pending","Daily Points BNF",{"$f":"Q14/5+3","v":83.6}]
[21,525,1575,210000,1923774.74,1,35,210000,2133774.7400000002,10.91603895370827,10.91603895370827,2270.8608222222224,544,null,"Pending"]
[23,575,1725,230000,2133774.7400000002,1,36,230000,2363774.7400000002,10.779019719766669,10.779019719766669,2526.4163777777781,592,null,"Pending","Final Capital",{"$f":"E26","v":4903774.74}]
[26,650,1950,260000,2363774.7400000002,1,37,260000,2623774.7400000002,10.999356055391301,10.999356055391301,2815.3052666666667,664,null,"Pending"]
[29,725,2175,290000,2623774.7400000002,1,38,290000,2913774.74,11.052778105486295,11.052778105486295,3137.5274888888889,736,null,"Pending","Final Return",{"$f":"L26","v":5948.6386000000002}]
[32,800,2400,320000,2913774.74,1,39,320000,3233774.74,10.982317734005752,10.982317734005752,3493.0830444444446,808,null,"Pending"]
[35,875,2625,350000,3233774.74,1,40,350000,3583774.74,10.823264702723232,10.823264702723232,3881.9719333333337,880,null,"Pending"]
[39,975,2925,390000,3583774.74,1,41,390000,3973774.74,10.882380403183488,10.882380403183488,4315.3052666666663,976,null,"Pending"]
[44,1100,3300,440000,3973774.74,1,42,440000,4413774.74,11.072595423463786,11.072595423463786,4804.1941555555559,1096,null,"Pending"]
[49,1225,3675,490000,4413774.74,1,43,490000,4903774.74,11.10160868789602,11.10160868789602,5348.6386000000002,1216,null,"Pending"]
[54,1350,4050,540000,4903774.74,1,44,540000,5443774.7400000002,11.011925070603874,11.011925070603874,5948.6386000000002,1336,null,"Pending"]

{"sheet":"Haircut for stocks pledgin","index":4,"n_rows":2090,"n_cols":6,"rows_kept":2090,"cut":false,"hidden":false,"merged":[[2089,1,2089,4],[3,0,3,4],[966,0,966,4],[1035,0,1035,4],[2080,0,2080,3],[2081,0,2081,3],[2082,0,2082,3],[2083,0,2083,3],[2084,0,2084,3],[2085,0,2085,4],[2086,0,2086,4],[2087,0,2087,3]]}
[]
[]
[]
["Approved Securities List for the Month of April 2021"]
[null,"Equity Shares"]
["Sr. No.","Security Name","ISIN","Haircut %","For every Rs 100 worth of stock pledged, you'll receive collateral margin of Rs.","Member wise limit reached"]
[1,"ADANIPORTS","INE742F01042",21,79,"No"]
[2,"ASIANPAINT","INE021A01026",16.27,83.73,"No"]
[3,"AXISBANK","INE238A01034",29.83,70.17,"No"]
[4,"BAJAJ-AUTO","INE917I01010",16.649999999999999,83.35,"No"]
[5,"BAJAJFINSV","INE918I01018",28.75,71.25,"No"]
[6,"BAJFINANCE","INE296A01024",24.63,75.37,"No"]
[7,"BHARTIARTL","INE397D01024",18.350000000000001,81.650000000000006,"No"]
[8,"BPCL","INE029A01011",44.02,55.98,"No"]
[9,"BRITANNIA","INE216A01030",15.85,84.15,"No"]
[10,"CIPLA","INE059A01026",16.82,83.18,"No"]
[11,"COALINDIA","INE522F01014",17.34,82.66,"No"]
[12,"DIVISLAB","INE361B01024",16.36,83.64,"No"]
[13,"DRREDDY","INE089A01023",15.64,84.36,"No"]
[14,"EICHERMOT","INE066A01021",18.91,81.09,"No"]
[15,"GRASIM","INE047A01021",25.13,74.87,"No"]
[16,"HCLTECH","INE860A01027",17.440000000000001,82.56,"No"]
[17,"HDFC","INE001A01036",25.87,74.13,"No"]
[18,"HDFCBANK","INE040A01034",16.54,83.46,"No"]
[19,"HDFCLIFE","INE795G01014",22.35,77.650000000000006,"No"]
[20,"HEROMOTOCO","INE158A01026",21,79,"No"]
[21,"HINDALCO","INE038A01020",27.26,72.739999999999995,"No"]
[22,"HINDUNILVR","INE030A01027",14.42,85.58,"No"]
[23,"ICICIBANK","INE090A01021",22.04,77.959999999999994,"No"]
[24,"INDUSINDBK","INE095A01012",51.79,48.21,"No"]
[25,"INFY","INE009A01021",16.66,83.34,"No"]
[26,"IOC","INE242A01010",16.66,83.34,"No"]
[27,"ITC","INE154A01025",15.96,84.04,"No"]
[28,"JSWSTEEL","INE019A01038",26.27,73.73,"No"]
[29,"KOTAKBANK","INE237A01028",28.41,71.59,"No"]
[30,"LT","INE018A01030",17.09,82.91,"No"]
[31,"M&M","INE101A01026",30.19,69.81,"No"]
[32,"MARUTI","INE585B01010",18.32,81.680000000000007,"No"]
[33,"NESTLEIND","INE239A01016",14.89,85.11,"No"]
[34,"NTPC","INE733E01010",16.260000000000002,83.74,"No"]
[35,"ONGC","INE213A01029",50.96,49.04,"No"]
[36,"POWERGRID","INE752E01010",16.36,83.64,"No"]
[37,"RELIANCE","INE002A01018",18.3,81.7,"No"]
[38,"SBILIFE","INE123W01016",17.68,82.32,"No"]
[39,"SBIN","INE062A01020",21.52,78.48,"No"]
[40,"SHREECEM","INE070A01015",18.420000000000002,81.58,"No"]
[41,"SUNPHARMA","INE044A01036",17.07,82.93,"No"]
[42,"TATACONSUM","INE192A01025",19.13,80.87,"No"]
[43,"TATAMOTORS","INE155A01022",27.75,72.25,"No"]
[44,"TATASTEEL","INE081A01012",22.29,77.709999999999994,"No"]
[45,"TCS","INE467B01029",15.46,84.54,"No"]
[46,"TECHM","INE669C01036",17.8,82.2,"No"]
[47,"TITAN","INE280A01028",20.55,79.45,"No"]
[48,"ULTRACEMCO","INE481G01011",17.47,82.53,"No"]
[49,"UPL","INE628A01036",23.18,76.819999999999993,"No"]
[50,"WIPRO","INE075A01022",17.899999999999999,82.1,"No"]
[51,"ABBOTINDIA","INE358A01014",14.81,85.19,"No"]
[52,"ACC","INE012A01025",16.329999999999998,83.67,"No"]
[53,"ADANIENT","INE423A01024",29.71,70.290000000000006,"No"]
[54,"ALKEM","INE540L01014",15.31,84.69,"No"]
[55,"AMBUJACEM","INE079A01024",18.09,81.91,"No"]
[56,"APOLLOHOSP","INE437A01024",23.42,76.58,"No"]
[57,"AUROPHARMA","INE406A01037",33.32,66.680000000000007,"No"]
[58,"BAJAJHLDNG","INE118A01012",19.02,80.98,"No"]
[59,"BANDHANBNK","INE545U01014",44.98,55.02,"No"]
[60,"BERGEPAINT","INE463A01038",16.2,83.8,"No"]
[61,"BIOCON","INE376G01013",22.5,77.5,"No"]
[62,"BOSCHLTD","INE323A01026",22.38,77.62,"No"]
[63,"CADILAHC","INE010B01027",17.75,82.25,"No"]
[64,"COLPAL","INE259A01022",14.5,85.5,"No"]
[65,"DABUR","INE016A01026",12.56,87.44,"No"]
[66,"DLF","INE271C01023",25.06,74.94,"No"]
[67,"DMART","INE192R01011",18.23,81.77,"No"]
[68,"GAIL","INE129A01019",19.93,80.069999999999993,"No"]
[69,"GODREJCP","INE102D01028",15.72,84.28,"No"]
[70,"HAVELLS","INE176B01034",19,81,"No"]
[71,"HDFCAMC","INE127D01025",18.239999999999998,81.760000000000005,"No"]
[72,"HINDPETRO","INE094A01015",34.700000000000003,65.3,"No"]
[73,"ICICIGI","INE765G01017",18.850000000000001,81.150000000000006,"No"]
[74,"ICICIPRULI","INE726G01019",21.78,78.22,"No"]
[75,"IGL","INE203G01027",18.95,81.05,"No"]
[76,"INDIGO","INE646L01027",28.12,71.88,"No"]
[77,"INDUSTOWER","INE121J01017",26.95,73.05,"No"]
[78,"JUBLFOOD","INE797F01012",41.94,58.06,"No"]
[79,"LTI","INE214T01019",20.38,79.62,"No"]
[80,"LUPIN","INE326A01037",17.61,82.39,"No"]
[81,"MARICO","INE196A01026",12.51,87.49,"No"]
[82,"MCDOWELL-N","INE854D01024",16.829999999999998,83.17,"No"]
[83,"MOTHERSUMI","INE775A01035",34.6,65.400000000000006,"No"]
[84,"MRF","INE883A01011",16.579999999999998,83.42,"No"]
[85,"MUTHOOTFIN","INE414G01012",27.45,72.55,"No"]
[86,"NAUKRI","INE663F01024",23.25,76.75,"No"]
[87,"NMDC","INE584A01023",31.95,68.05,"No"]
[88,"PEL","INE140A01024",49.45,50.55,"No"]
[89,"PETRONET","INE347G01014",16.7,83.3,"No"]
[90,"PGHH","INE179A01014",13.42,86.58,"No"]
[91,"PIDILITIND","INE318A01026",15.42,84.58,"No"]
[92,"PNB","INE160A01022",23.33,76.67,"No"]
[93,"SBICARD","INE018E01016",17.899999999999999,82.1,"No"]
[94,"SIEMENS","INE003A01024",16.93,83.07,"No"]
[95,"TORNTPHARM","INE685A01028",16.95,83.05,"No"]
[96,"UBL","INE686F01025",17.14,82.86,"No"]
[97,"VEDL","INE205A01025",69.989999999999995,30.01,"No"]
[98,"20MICRONS","INE144J01027",22.61,77.39,"No"]
[99,"3MINDIA","INE470A01017",18.36,81.64,"No"]
[100,"5PAISA","INE618L01018",29.84,70.16,"No"]
[101,"AARTIDRUGS","INE767A01016",25.67,74.33,"No"]
[102,"AARTIIND","INE769A01020",19.440000000000001,80.56,"No"]
[103,"AAVAS","INE216P01012",21.3,78.7,"No"]
[104,"ABB","INE117A01022",16.98,83.02,"No"]
[105,"ABCAPITAL","INE674K01013",25.18,74.819999999999993,"No"]
[106,"ABFRL","INE647O01011",20.66,79.34,"No"]
[107,"ACCELYA","INE793A01012",14.54,85.46,"No"]
[108,"ADANIPOWER","INE814H01011",28.29,71.709999999999994,"No"]
[109,"ADFFOODS","INE982B01019",23.29,76.709999999999994,"No"]
[110,"ADORWELD","INE045A01017",22.48,77.52,"No"]
[111,"ADVENZYMES","INE837H01020",24.22,75.78,"No"]
[112,"AEGISCHEM","INE208C01025",23.05,76.95,"No"]
[113,"AFFLE","INE00WC01019",23.4,76.599999999999994,"No"]
[114,"AHLUCONT","INE758C01029",23.07,76.930000000000007,"No"]
[115,"AIAENG","INE212H01026",17.84,82.16,"No"]
[116,"AJANTPHARM","INE031B01049",17.39,82.61,"No"]
[117,"AJMERA","INE298G01027",26.53,73.47,"No"]
[118,"AKSHARCHEM","INE542B01011",24.56,75.44,"No"]
[119,"AKZOINDIA","INE133A01011",16.32,83.68,"No"]
[120,"ALANKIT","INE914E01040",27.6,72.400000000000006,"No"]
[121,"ALBERTDAVD","INE155C01010",21.96,78.040000000000006,"No"]
[122,"ALEMBICLTD","INE426A01027",25.21,74.790000000000006,"No"]
[123,"ALICON","INE062D01024",26.43,73.569999999999993,"No"]
[124,"ALKYLAMINE","INE150B01021",26.19,73.81,"No"]
[125,"ALLCARGO","INE418H01029",19.63,80.37,"No"]
[126,"ALLSEC","INE835G01018",26.48,73.52,"No"]
[127,"ALPHAGEO","INE137C01018",27.88,72.12,"No"]
[128,"AMARAJABAT","INE885A01032",17.77,82.23,"No"]
[129,"AMBER","INE371P01015",50,50,"No"]
[130,"AMBIKCO","INE540G01014",19.010000000000002,80.989999999999995,"No"]
[131,"AMRUTANJAN","INE098F01031",22.42,77.58,"No"]
[132,"ANDHRAPAP","INE435A01028",22.05,77.95,"No"]
[133,"ANDHRSUGAR","INE715B01013",23.22,76.78,"No"]
[134,"ANGELBRKG","INE732I01013",16.68,83.32,"No"]
[135,"ANUP","INE294Z01018",25.03,74.97,"No"]
[136,"APARINDS","INE372A01015",18.809999999999999,81.19,"No"]
[137,"APCL","INE071F01012",23.44,76.56,"No"]
[138,"APCOTEXIND","INE116A01032",24.99,75.010000000000005,"No"]
[139,"APEX","INE346W01013",25.03,74.97,"No"]
[140,"APLLTD","INE901L01018",20.21,79.790000000000006,"No"]
[141,"APOLLO","INE713T01010",28.84,71.16,"No"]
[142,"APOLLOTYRE","INE438A01022",23.62,76.38,"No"]
[143,"APTECHT","INE266F01018",28.61,71.39,"No"]
[144,"ARIES","INE298I01015",26.14,73.86,"No"]
[145,"ARMANFIN","INE109C01017",24.28,75.72,"No"]
[146,"ARVIND","INE034A01011",27.86,72.14,"No"]
[147,"ARVINDFASN","INE955V01021",22.93,77.069999999999993,"No"]
[148,"ARVSMART","INE034S01021",24.25,75.75,"No"]
[149,"ASAHIINDIA","INE439A01020",21.21,78.790000000000006,"No"]
[150,"ASAHISONG","INE228I01012",27.96,72.040000000000006,"No"]
[151,"ASALCBR","INE073G01016",19,81,"No"]
[152,"ASHIANA","INE365D01021",100,0,"No"]
[153,"ASHOKA","INE442H01029",25.87,74.13,"No"]
[154,"ASHOKLEY","INE208A01029",32.25,67.75,"No"]
[155,"ASIANTILES","INE022I01019",27.57,72.430000000000007,"No"]
[156,"ASTEC","INE563J01010",25.13,74.87,"No"]
[157,"ASTERDM","INE914M01019",20.87,79.13,"No"]
[158,"ASTRAL","INE006I01046",24.27,75.73,"No"]
[159,"ASTRAMICRO","INE386C01029",23.73,76.27,"No"]
[160,"ASTRAZEN","INE203A01020",22.32,77.680000000000007,"No"]
[161,"ASTRON","INE646X01014",24.91,75.09,"No"]
[162,"ATFL","INE209A01019",20.29,79.709999999999994,"No"]
[163,"ATUL","INE100A01010",17.16,82.84,"No"]
[164,"ATULAUTO","INE951D01028",19.36,80.64,"No"]
[165,"AUBANK","INE949L01017",24.09,75.91,"No"]
[166,"AUTOAXLES","INE449A01011",23.84,76.16,"No"]
[167,"AVADHSUGAR","INE349W01017",27.47,72.53,"No"]
[168,"AVANTIFEED","INE871C01038",22.16,77.84,"No"]
[169,"AVTNPL","INE488D01021",24.11,75.89,"No"]
[170,"AWHCL","INE01BK01022",12.5,87.5,"No"]
[171,"BAJAJCON","INE933K01021",22.98,77.02,"No"]
[172,"BAJAJHIND","INE306A01021",28.29,71.709999999999994,"No"]
[173,"BALAJITELE","INE794B01026",25.03,74.97,"No"]
[174,"BALAMINES","INE050E01027",30.65,69.349999999999994,"No"]
[175,"BALKRISIND","INE787D01026",22.74,77.260000000000005,"No"]
[176,"BALMLAWRIE","INE164A01016",20.29,79.709999999999994,"No"]
[177,"BALRAMCHIN","INE119A01028",25.54,74.459999999999994,"No"]
[178,"BANARISUG","INE459A01010",18.47,81.53,"No"]
[179,"BANCOINDIA","INE213C01025",22.81,77.19,"No"]
[180,"BANKBARODA","INE028A01039",42.69,57.31,"No"]
[181,"BANKINDIA","INE084A01016",27.88,72.12,"No"]
[182,"BASF","INE373A01013",22.39,77.61,"No"]
[183,"BATAINDIA","INE176A01028",17.03,82.97,"No"]
[184,"BAYERCROP","INE462A01022",17.53,82.47,"No"]
[185,"BBL","INE464A01028",19.64,80.36,"No"]
[186,"BBTC","INE050A01025",21.4,78.599999999999994,"No"]
[187,"BCLIND","INE412G01016",16.29,83.71,"No"]
[188,"BDL","INE171Z01018",22.45,77.55,"No"]
[189,"BECTORFOOD","INE495P01012",14.73,85.27,"No"]
[190,"BEL","INE263A01024",21.52,78.48,"No"]
[191,"BEML","INE258A01016",25.74,74.260000000000005,"No"]
[192,"BEPL","INE922A01025",29.93,70.069999999999993,"No"]
[193,"BFINVEST","INE878K01010",25.7,74.3,"No"]
[194,"BFUTILITIE","INE243D01012",25.31,74.69,"No"]
[195,"BGRENERGY","INE661I01014",31.11,68.89,"No"]
[196,"BHAGERIA","INE354C01027",22.85,77.150000000000006,"No"]
[197,"BHARATFORG","INE465A01025",22.53,77.47,"No"]
[198,"BHARATRAS","INE838B01013",20.92,79.08,"No"]
[199,"BHEL","INE257A01026",43.48,56.52,"No"]
[200,"BIRLACABLE","INE800A01015",28.9,71.099999999999994,"No"]
[201,"BIRLACORPN","INE340A01012",23.75,76.25,"No"]
[202,"BIRLAMONEY","INE865C01022",25.47,74.53,"No"]
[203,"BIRLATYRE","INE0AEJ01013",29.76,70.239999999999995,"No"]
[204,"BLISSGVS","INE416D01022",50,50,"No"]
[205,"BLS","INE153T01027",29.68,70.319999999999993,"No"]
[206,"BLUEDART","INE233B01017",20.28,79.72,"No"]
[207,"BLUESTARCO","INE472A01039",17.36,82.64,"No"]
[208,"BODALCHEM","INE338D01028",26.38,73.62,"No"]
[209,"BOMDYEING","INE032A01023",25.1,74.900000000000006,"No"]
[210,"BOROLTD","INE02PY01013",19.510000000000002,80.489999999999995,"No"]
[211,"BRIGADE","INE791I01019",22.45,77.55,"No"]
[212,"BSE","INE118H01025",17.73,82.27,"No"]
[213,"BSOFT","INE836A01035",25.63,74.37,"No"]
[214,"BURGERKING","INE07T201019",20.03,79.97,"No"]
[215,"BUTTERFLY","INE295F01017",28.96,71.040000000000006,"No"]
[216,"CAMLINFINE","INE052I01032",25.11,74.89,"No"]
[217,"CAMS","INE596I01012",12.76,87.24,"No"]
[218,"CANBK","INE476A01014",33.409999999999997,66.59,"No"]
[219,"CANFINHOME","INE477A01020",20.92,79.08,"No"]
[220,"CANTABIL","INE068L01016",19.350000000000001,80.650000000000006,"No"]
[221,"CAPACITE","INE264T01014",25.31,74.69,"No"]
[222,"CAPLIPOINT","INE475E01026",24.72,75.28,"No"]
[223,"CARBORUNIV","INE120A01034",20.239999999999998,79.760000000000005,"No"]
[224,"CAREERP","INE521J01018",24.38,75.62,"No"]
[225,"CARERATING","INE752H01013",23.11,76.89,"No"]
[226,"CASTROLIND","INE172A01027",17.100000000000001,82.9,"No"]
[227,"CCL","INE421D01022",18.190000000000001,81.81,"No"]
[228,"CDSL","INE736A01011",100,0,"No"]
[229,"CEATLTD","INE482A01020",19.05,80.95,"No"]
[230,"CENTENKA","INE485A01015",19.95,80.05,"No"]
[231,"CENTRALBK","INE483A01010",29.28,70.72,"No"]
[232,"CENTRUM","INE660C01027",24.28,75.72,"No"]
[233,"CENTUM","INE320B01020",25.76,74.239999999999995,"No"]
[234,"CENTURYPLY","INE348B01021",21.14,78.86,"No"]
[235,"CENTURYTEX","INE055A01016",24.26,75.739999999999995,"No"]
[236,"CERA","INE739E01017",18.420000000000002,81.58,"No"]
[237,"CEREBRAINT","INE345B01019",24.47,75.53,"No"]
[238,"CESC","INE486A01013",16.95,83.05,"No"]
[239,"CGCL","INE180C01026",100,0,"No"]
[240,"CHALET","INE427F01016",21.78,78.22,"No"]
[241,"CHAMBLFERT","INE085A01013",19.600000000000001,80.400000000000006,"No"]
[242,"CHEMBOND","INE995D01025",24.14,75.86,"No"]
[243,"CHEMCON","INE03YM01018",16.96,83.04,"No"]
[244,"CHENNPETRO","INE178A01016",27.41,72.59,"No"]
[245,"CHOLAFIN","INE121A01024",34.51,65.489999999999995,"No"]
[246,"CHOLAHLDNG","INE149A01033",18.46,81.540000000000006,"No"]
[247,"CIGNITITEC","INE675C01017",50,50,"No"]
[248,"CINELINE","INE704H01022",31.26,68.739999999999995,"No"]
[249,"CLNINDIA","INE492A01029",22.74,77.260000000000005,"No"]
[250,"COCHINSHIP","INE704P01017",18.920000000000002,81.08,"No"]
[251,"COFORGE","INE591G01017",24.84,75.16,"No"]
[252,"COMPINFO","INE070C01037",31.2,68.8,"No"]
[253,"CONCOR","INE111A01025",33.659999999999997,66.34,"No"]
[254,"CONFIPET","INE552D01024",29.12,70.88,"No"]
[255,"CONTROLPR","INE663B01015",36.200000000000003,63.8,"No"]
[256,"COROMANDEL","INE169A01031",16.86,83.14,"No"]
[257,"CREDITACC","INE741K01010",22.26,77.739999999999995,"No"]
[258,"CRISIL","INE007A01025",15.22,84.78,"No"]
[259,"CROMPTON","INE299U01018",17.54,82.46,"No"]
[260,"CSBBANK","INE679A01013",20.6,79.400000000000006,"No"]
[261,"CUB","INE491A01021",20.66,79.34,"No"]
[262,"CUMMINSIND","INE298A01020",20.73,79.27,"No"]
[263,"CUPID","INE509F01011",24.09,75.91,"No"]
[264,"CYBERTECH","INE214A01019",36.229999999999997,63.77,"No"]
[265,"DAAWAT","INE818H01020",26.1,73.900000000000006,"No"]
[266,"DALMIASUG","INE495A01022",26.61,73.39,"No"]
[267,"DATAMATICS","INE365B01017",28.93,71.069999999999993,"No"]
[268,"DBCORP","INE950I01011",17.91,82.09,"No"]
[269,"DBL","INE917M01012",24.1,75.900000000000006,"No"]
[270,"DCAL","INE385W01011",29.04,70.959999999999994,"No"]
[271,"DCBBANK","INE503A01015",22.03,77.97,"No"]
[272,"DCMSHRIRAM","INE499A01024",24.92,75.08,"No"]
[273,"DCW","INE500A01029",30.67,69.33,"No"]
[274,"DECCANCE","INE583C01021",21.8,78.2,"No"]
[275,"DEEPAKFERT","INE501A01019",100,0,"No"]
[276,"DEEPAKNTR","INE288B01029",24.47,75.53,"No"]
[277,"DELTACORP","INE124G01033",26.1,73.900000000000006,"No"]
[278,"DEN","INE947J01015",26.35,73.650000000000006,"No"]
[279,"DENORA","INE244A01016",27.01,72.989999999999995,"No"]
[280,"DFMFOODS","INE456C01020",23.06,76.94,"No"]
[281,"DHAMPURSUG","INE041A01016",24.26,75.739999999999995,"No"]
[282,"DHANBANK","INE680A01011",23.98,76.02,"No"]
[283,"DHANI","INE274G01010",100,0,"No"]
[284,"DHANUKA","INE435G01025",19.329999999999998,80.67,"No"]
[285,"DIAMONDYD","INE393P01035",16.850000000000001,83.15,"No"]
[286,"DICIND","INE303A01010",17.260000000000002,82.74,"No"]
[287,"DISHTV","INE836F01026",32.39,67.61,"No"]
[288,"DLINKINDIA","INE250K01012",25.34,74.66,"No"]
[289,"DOLAT","INE966A01022",25.39,74.61,"No"]
[290,"DOLLAR","INE325C01035",23.24,76.760000000000005,"No"]
[291,"DREDGECORP","INE506A01018",26.73,73.27,"No"]
[292,"DTIL","INE341R01014",20.66,79.34,"No"]
[293,"DWARKESH","INE366A01041",26.73,73.27,"No"]
[294,"DYNAMATECH","INE221B01012",25.52,74.48,"No"]
[295,"DYNPRO","INE256H01015",29.05,70.95,"No"]
[296,"EBIXFOREX","INE726L01019",27.02,72.98,"No"]
[297,"ECLERX","INE738I01010",23.07,76.930000000000007,"No"]
[298,"EDELWEISS","INE532F01054",28.69,71.31,"No"]
[299,"EIDPARRY","INE126A01031",22.34,77.66,"No"]
[300,"EIHAHOTELS","INE276C01014",20.89,79.11,"No"]
[301,"EIHOTEL","INE230A01023",21.26,78.739999999999995,"No"]
[302,"ELECTCAST","INE086A01029",100,0,"No"]
[303,"ELECTHERM","INE822G01016",29.35,70.650000000000006,"No"]
[304,"EMAMIPAP","INE830C01026",29.74,70.260000000000005,"No"]
[305,"EMMBI","INE753K01015",26.82,73.180000000000007,"No"]
[306,"ENDURANCE","INE913H01037",19.920000000000002,80.08,"No"]
[307,"ENGINERSIN","INE510A01028",18.77,81.23,"No"]
[308,"ENIL","INE265F01028",22.64,77.36,"No"]
[309,"EPL","INE255A01020",21.33,78.67,"No"]
[310,"EQUITAS","INE988K01017",28.17,71.83,"No"]
[311,"EQUITASBNK","INE063P01018",18.260000000000002,81.739999999999995,"No"]
[312,"ERIS","INE406M01024",16.850000000000001,83.15,"No"]
[313,"EROSMEDIA","INE416L01017",27.55,72.45,"No"]
[314,"ESABINDIA","INE284A01012",21.23,78.77,"No"]
[315,"ESCORTS","INE042A01014",27.31,72.69,"No"]
[316,"ESTER","INE778B01029",28.31,71.69,"No"]
[317,"EVEREADY","INE128A01029",25.61,74.39,"No"]
[318,"EVERESTIND","INE295A01018",25.73,74.27,"No"]
[319,"EXCELINDUS","INE369A01029",22.02,77.98,"No"]
[320,"EXIDEIND","INE302A01020",16.170000000000002,83.83,"No"]
[321,"EXPLEOSOL","INE201K01015",25.91,74.09,"No"]
[322,"FACT","INE188A01015",34.42,65.58,"No"]
[323,"FAIRCHEMOR","INE0DNW01011",12.5,87.5,"No"]
[324,"FDC","INE258B01022",19.579999999999998,80.42,"No"]
[325,"FEDERALBNK","INE171A01029",29.08,70.92,"No"]
[326,"FIEMIND","INE737H01014",24.63,75.37,"No"]
[327,"FILATEX","INE816B01027",28.68,71.319999999999993,"No"]
[328,"FINCABLES","INE235A01022",20.440000000000001,79.56,"No"]
[329,"FINEORG","INE686Y01026",19.48,80.52,"No"]
[330,"FINPIPE","INE183A01016",0,100,"No"]
[331,"FLFL","INE452O01016",27.98,72.02,"No"]
[332,"FLUOROCHEM","INE09N301011",21.84,78.16,"No"]
[333,"FMGOETZE","INE529A01010",22.52,77.48,"No"]
[334,"FORCEMOT","INE451A01017",20.059999999999999,79.94,"No"]
[335,"FORTIS","INE061F01013",17.71,82.29,"No"]
[336,"FOSECOIND","INE519A01011",16.809999999999999,83.19,"No"]
[337,"FRETAIL","INE752P01024",29.61,70.39,"No"]
[338,"FSL","INE684F01012",26.01,73.989999999999995,"No"]
[339,"GABRIEL","INE524A01029",24.84,75.16,"No"]
[340,"GAEL","INE036B01030",25.35,74.650000000000006,"No"]
[341,"GALAXYSURF","INE600K01018",18.03,81.97,"No"]
[342,"GANDHITUBE","INE524B01027",19.34,80.66,"No"]
[343,"GARFIBRES","INE276A01018",20.22,79.78,"No"]
[344,"GATI","INE152B01027",28.13,71.87,"No"]
[345,"GDL","INE852F01015",23.05,76.95,"No"]
[346,"GEPIL","INE878A01011",23.22,76.78,"No"]
[347,"GESHIP","INE017A01032",22.72,77.28,"No"]
[348,"GET&D","INE200A01026",24.76,75.239999999999995,"No"]
[349,"GHCL","INE539A01019",21.69,78.31,"No"]
[350,"GICHSGFIN","INE289B01019",24.22,75.78,"No"]
[351,"GICRE","INE481Y01014",26.06,73.94,"No"]
[352,"GILLETTE","INE322A01010",12.5,87.5,"No"]
[353,"GIPCL","INE162A01010",18.46,81.540000000000006,"No"]
[354,"GLAND","INE068V01023",15.62,84.38,"No"]
[355,"GLAXO","INE159A01016",13.72,86.28,"No"]
[356,"GLENMARK","INE935A01035",39.99,60.01,"No"]
[357,"GLOBUSSPR","INE615I01010",25.92,74.08,"No"]
[358,"GMDCLTD","INE131A01031",22.17,77.83,"No"]
[359,"GMMPFAUDLR","INE541A01023",24.74,75.260000000000005,"No"]
[360,"GMRINFRA","INE776C01039",22.7,77.3,"No"]
[361,"GNA","INE934S01014",24.85,75.150000000000006,"No"]
[362,"GNFC","INE113A01013",23.04,76.959999999999994,"No"]
[363,"GOCLCORP","INE077F01035",23.13,76.87,"No"]
[364,"GODFRYPHLP","INE260B01028",17.66,82.34,"No"]
[365,"GODREJAGRO","INE850D01014",16.670000000000002,83.33,"No"]
[366,"GODREJIND","INE233A01035",15.69,84.31,"No"]
[367,"GODREJPROP","INE484J01027",23.68,76.319999999999993,"No"]
[368,"GOKEX","INE887G01027",28.37,71.63,"No"]
[369,"GOLDIAM","INE025B01017",29.02,70.98,"No"]
[370,"GOODLUCK","INE127I01024",31.02,68.98,"No"]
[371,"GPIL","INE177H01013",50,50,"No"]
[372,"GPPL","INE517F01014",19.829999999999998,80.17,"No"]
[373,"GRANULES","INE101D01020",24.35,75.650000000000006,"No"]
[374,"GRAPHITE","INE371A01025",29.26,70.739999999999995,"No"]
[375,"GREAVESCOT","INE224A01026",23.12,76.88,"No"]
[376,"GREENLAM","INE544R01013",18.489999999999998,81.510000000000005,"No"]
[377,"GREENPLY","INE461C01038",23.85,76.150000000000006,"No"]
[378,"GRINDWELL","INE536A01023",17.55,82.45,"No"]
[379,"GRSE","INE382Z01011",22.18,77.819999999999993,"No"]
[380,"GSCLCEMENT","INE542A01039",27.17,72.83,"No"]
[381,"GSFC","INE026A01025",22.26,77.739999999999995,"No"]
[382,"GSPL","INE246F01010",18.43,81.569999999999993,"No"]
[383,"GSS","INE871H01011",32.96,67.040000000000006,"No"]
[384,"GUFICBIO","INE742B01025",26.45,73.55,"No"]
[385,"GUJALKALI","INE186A01019",24.11,75.89,"No"]
[386,"GUJAPOLLO","INE826C01016",28.27,71.73,"No"]
[387,"GUJGASLTD","INE844O01030",19.420000000000002,80.58,"No"]
[388,"GULFOILLUB","INE635Q01029",18.54,81.459999999999994,"No"]
[389,"GULFPETRO","INE586G01017",25.15,74.849999999999994,"No"]
[390,"GULPOLY","INE255D01024",100,0,"No"]
[391,"HAL","INE066F01012",20.85,79.150000000000006,"No"]
[392,"HAPPSTMNDS","INE419U01012",18.97,81.03,"No"]
[393,"HARITASEAT","INE939D01015",0,100,"No"]
[394,"HARRMALAYA","INE544A01019",26.97,73.03,"No"]
[395,"HATHWAY","INE982F01036",29.3,70.7,"No"]
[396,"HATSUN","INE473B01035",19.16,80.84,"No"]
[397,"HCC","INE549A01026",29.79,70.209999999999994,"No"]
[398,"HCG","INE075I01017",20.49,79.510000000000005,"No"]
[399,"HEG","INE545A01016",31.61,68.39,"No"]
[400,"HEIDELBERG","INE578A01017",17.920000000000002,82.08,"No"]
[401,"HERANBA","INE694N01015",12.5,87.5,"No"]
[402,"HERCULES","INE688E01024",26.31,73.69,"No"]
[403,"HERITGFOOD","INE978A01027",24.37,75.63,"No"]
[404,"HESTERBIO","INE782E01017",24.54,75.459999999999994,"No"]
[405,"HGINFRA","INE926X01010",24.09,75.91,"No"]
[406,"HGS","INE170I01016",25.91,74.09,"No"]
[407,"HIKAL","INE475B01022",24.36,75.64,"No"]
[408,"HIMATSEIDE","INE049A01027",100,0,"No"]
[409,"HINDCOMPOS","INE310C01029",26.77,73.23,"No"]
[410,"HINDCOPPER","INE531E01026",31.97,68.03,"No"]
[411,"HINDOILEXP","INE345A01011",24.98,75.02,"No"]
[412,"HINDZINC","INE267A01025",19.920000000000002,80.08,"No"]
[413,"HIRECT","INE835D01023",22.96,77.040000000000006,"No"]
[414,"HITECH","INE106T01017",27.66,72.34,"No"]
[415,"HMVL","INE871K01015",22.29,77.709999999999994,"No"]
[416,"HOMEFIRST","INE481N01025",14.82,85.18,"No"]
[417,"HONAUT","INE671A01010",18.989999999999998,81.010000000000005,"No"]
[418,"HONDAPOWER","INE634A01018",17.66,82.34,"No"]
[419,"HSCL","INE019C01026",28.7,71.3,"No"]
[420,"HSIL","INE415A01038",26.53,73.47,"No"]
[421,"HUDCO","INE031A01017",23.2,76.8,"No"]
[422,"HUHTAMAKI","INE275B01026",21.13,78.87,"No"]
[423,"IBREALEST","INE069I01010",31.59,68.41,"No"]
[424,"IBULHSGFIN","INE148I01020",42.59,57.41,"No"]
[425,"ICIL","INE483B01026",30.88,69.12,"No"]
[426,"ICRA","INE725G01011",20.43,79.569999999999993,"No"]
[427,"IDBI","INE008A01015",28.3,71.7,"No"]
[428,"IDEA","INE669E01016",100,0,"No"]
[429,"IDFCFIRSTB","INE092T01019",47.1,52.9,"No"]
[430,"IEX","INE022Q01020",19.86,80.14,"No"]
[431,"IFBAGRO","INE076C01018",26.16,73.84,"No"]
[432,"IFBIND","INE559A01017",26.01,73.989999999999995,"No"]
[433,"IFCI","INE039A01010",31.58,68.42,"No"]
[434,"IGARASHI","INE188B01013",25.81,74.19,"No"]
[435,"IGPL","INE204A01010",28.68,71.319999999999993,"No"]
[436,"IIFLSEC","INE489L01022",32.729999999999997,67.27,"No"]
[437,"IIFLWAM","INE466L01020",18.86,81.14,"No"]
[438,"IMFA","INE919H01018",25.09,74.91,"No"]
[439,"IMPAL","INE547E01014",16.600000000000001,83.4,"No"]
[440,"INDHOTEL","INE053A01029",21.36,78.64,"No"]
[441,"INDIACEM","INE383A01012",24.62,75.38,"No"]
[442,"INDIAGLYCO","INE560A01015",69.989999999999995,30.01,"No"]
[443,"INDIAMART","INE933S01016",24.81,75.19,"No"]
[444,"INDIANB","INE562A01011",27.04,72.959999999999994,"No"]
[445,"INDIANHUME","INE323C01030",23.27,76.73,"No"]
[446,"INDIGOPNTS","INE09VQ01012",13.35,86.65,"No"]
[447,"INDNIPPON","INE092B01025",23.04,76.959999999999994,"No"]
[448,"INDOCO","INE873D01024",24.55,75.45,"No"]
[449,"INDOSTAR","INE896L01010",22.21,77.790000000000006,"No"]
[450,"INDRAMEDCO","INE681B01017",21.77,78.23,"No"]
[451,"INEOSSTYRO","INE189B01011",23.13,76.87,"No"]
[452,"INFIBEAM","INE483S01020",30.62,69.38,"No"]
[453,"INGERRAND","INE177A01018",16.670000000000002,83.33,"No"]
[454,"INOXLEISUR","INE312H01016",21.35,78.650000000000006,"No"]
[455,"INOXWIND","INE066P01011",29.51,70.489999999999995,"No"]
[456,"INSECTICID","INE070I01018",20.87,79.13,"No"]
[457,"IOB","INE565A01014",28.94,71.06,"No"]
[458,"IOLCP","INE485C01011",28.13,71.87,"No"]
[459,"IPCALAB","INE571A01020",19.010000000000002,80.989999999999995,"No"]
[460,"IRB","INE821I01014",25.33,74.67,"No"]
[461,"IRCON","INE962Y01021",21.17,78.83,"No"]
[462,"IRCTC","INE335Y01012",19.79,80.209999999999994,"No"]
[463,"IRFC","INE053F01010",12.5,87.5,"No"]
[464,"ISEC","INE763G01038",21.61,78.39,"No"]
[465,"ITDC","INE353K01014",28.96,71.040000000000006,"No"]
[466,"ITDCEM","INE686A01026",29.49,70.510000000000005,"No"]
[467,"ITI","INE248A01017",26.13,73.87,"No"]
[468,"J&KBANK","INE168A01041",28.06,71.94,"No"]
[469,"JAGRAN","INE199G01027",69.989999999999995,30.01,"No"]
[470,"JAGSNPHARM","INE048B01027",31.08,68.92,"No"]
[471,"JAICORPLTD","INE070D01027",24.11,75.89,"No"]
[472,"JAMNAAUTO","INE039C01032",25.68,74.319999999999993,"No"]
[473,"JASH","INE039O01011",21.86,78.14,"No"]
[474,"JAYAGROGN","INE785A01026",25.74,74.260000000000005,"No"]
[475,"JAYBARMARU","INE571B01028",23.69,76.31,"No"]
[476,"JAYSREETEA","INE364A01020",22.29,77.709999999999994,"No"]
[477,"JBCHEPHARM","INE572A01028",19.309999999999999,80.69,"No"]
[478,"JCHAC","INE782A01015",20.94,79.06,"No"]
[479,"JINDALPOLY","INE197D01010",27.1,72.900000000000006,"No"]
[480,"JINDALSAW","INE324A01024",24.44,75.56,"No"]
[481,"JINDALSTEL","INE749A01030",34.54,65.459999999999994,"No"]
[482,"JINDRILL","INE742C01031",25.02,74.98,"No"]
[483,"JINDWORLD","INE247D01039",24.26,75.739999999999995,"No"]
[484,"JKIL","INE576I01022",24.52,75.48,"No"]
[485,"JKLAKSHMI","INE786A01032",19.989999999999998,80.010000000000005,"No"]
[486,"JKPAPER","INE789E01012",24.11,75.89,"No"]
[487,"JMCPROJECT","INE890A01024",26.84,73.16,"No"]
[488,"JMFINANCIL","INE780C01023",21.67,78.33,"No"]
[489,"JOCIL","INE839G01010",27.99,72.010000000000005,"No"]
[490,"JSL","INE220G01021",100,0,"No"]
[491,"JSLHISAR","INE455T01018",69.989999999999995,30.01,"No"]
[492,"JSWENERGY","INE121E01018",23.44,76.56,"No"]
[493,"JSWHL","INE824G01012",21.46,78.540000000000006,"No"]
[494,"JSWISPL","INE743C01021",69.989999999999995,30.01,"No"]
[495,"JTEKTINDIA","INE643A01035",25.46,74.540000000000006,"No"]
[496,"JUBLINDS","INE645L01011",27.88,72.12,"No"]
[497,"JUBLPHARMA","INE700A01033",24.17,75.83,"No"]
[498,"JUSTDIAL","INE599M01018",32.630000000000003,67.37,"No"]
[499,"JYOTHYLAB","INE668F01031",16.73,83.27,"No"]
[500,"KAJARIACER","INE217B01036",17.649999999999999,82.35,"No"]
[501,"KAKATCEM","INE437B01014",23.51,76.489999999999995,"No"]
[502,"KALPATPOWR","INE220B01022",20.41,79.59,"No"]
[503,"KAMATHOTEL","INE967C01018",28.27,71.73,"No"]
[504,"KAMDHENU","INE390H01012",28.21,71.790000000000006,"No"]
[505,"KANPRPLA","INE694E01014",15.73,84.27,"No"]
[506,"KANSAINER","INE531A01024",18.96,81.040000000000006,"No"]
[507,"KARURVYSYA","INE036D01028",25.25,74.75,"No"]
[508,"KAYA","INE587G01015",24.48,75.52,"No"]
[509,"KCP","INE805C01028",24.16,75.84,"No"]
[510,"KCPSUGIND","INE790B01024",23.98,76.02,"No"]
[511,"KEC","INE389H01022",19.649999999999999,80.349999999999994,"No"]
[512,"KEI","INE878B01027",21,79,"No"]
[513,"KELLTONTEC","INE164B01022",31.97,68.03,"No"]
[514,"KENNAMET","INE717A01029",20.420000000000002,79.58,"No"]
[515,"KESORAMIND","INE087A01019",29.65,70.349999999999994,"No"]
[516,"KHAICHEM","INE745B01028",20.04,79.959999999999994,"No"]
[517,"KICL","INE029L01018",17.8,82.2,"No"]
[518,"KINGFA","INE473D01015",25.46,74.540000000000006,"No"]
[519,"KIOCL","INE880L01014",27.86,72.14,"No"]
[520,"KIRIINDUS","INE415I01015",24.27,75.73,"No"]
[521,"KIRLFER","INE884B01025",22.66,77.34,"No"]
[522,"KIRLOSBROS","INE732A01036",50,50,"No"]
[523,"KIRLOSENG","INE146L01010",22.02,77.98,"No"]
[524,"KITEX","INE602G01020",20.77,79.23,"No"]
[525,"KKCL","INE401H01017",15.72,84.28,"No"]
[526,"KMSUGAR","INE157H01023",28.2,71.8,"No"]
[527,"KNRCON","INE634I01029",20.100000000000001,79.900000000000006,"No"]
[528,"KOKUYOCMLN","INE760A01029",25.07,74.930000000000007,"No"]
[529,"KOLTEPATIL","INE094I01018",23.39,76.61,"No"]
[530,"KPITTECH","INE04I401011",100,0,"No"]
[531,"KPRMILL","INE930H01023",23.55,76.45,"No"]
[532,"KRBL","INE001B01026",27.96,72.040000000000006,"No"]
[533,"KSB","INE999A01015",19.739999999999998,80.260000000000005,"No"]
[534,"KSCL","INE455I01029",22.8,77.2,"No"]
[535,"KSL","INE907A01026",21.84,78.16,"No"]
[536,"KTKBANK","INE614B01018",19.899999999999999,80.099999999999994,"No"]
[537,"L&TFH","INE498L01015",25.99,74.010000000000005,"No"]
[538,"LALPATHLAB","INE600L01024",21.27,78.73,"No"]
[539,"LAOPALA","INE059D01020",19.43,80.569999999999993,"No"]
[540,"LASA","INE670X01014",27.08,72.92,"No"]
[541,"LAURUSLABS","INE947Q01028",22.99,77.010000000000005,"No"]
[542,"LEMONTREE","INE970X01018",25.41,74.59,"No"]
[543,"LGBBROSLTD","INE337A01034",23.93,76.069999999999993,"No"]
[544,"LIBERTSHOE","INE557B01019",22.82,77.180000000000007,"No"]
[545,"LICHSGFIN","INE115A01026",30.53,69.47,"No"]
[546,"LINCOLN","INE405C01035",23.72,76.28,"No"]
[547,"LOVABLE","INE597L01014",27.56,72.44,"No"]
[548,"LTTS","INE010V01017",21.29,78.709999999999994,"No"]
[549,"LUMAXIND","INE162B01018",21.37,78.63,"No"]
[550,"LUMAXTECH","INE872H01027",27.83,72.17,"No"]
[551,"LUXIND","INE150G01020",17.09,82.91,"No"]
[552,"M&MFIN","INE774D01024",30.93,69.069999999999993,"No"]
[553,"MAANALU","INE215I01019",33.840000000000003,66.16,"No"]
[554,"MAGADSUGAR","INE347W01011",26.18,73.819999999999993,"No"]
[555,"MAHABANK","INE457A01014",30.71,69.290000000000006,"No"]
[556,"MAHEPC","INE215D01010",22.72,77.28,"No"]
[557,"MAHINDCIE","INE536H01010",23.92,76.08,"No"]
[558,"MAHLIFE","INE813A01018",18.899999999999999,81.099999999999994,"No"]
[559,"MAHLOG","INE766P01016",22.08,77.92,"No"]
[560,"MAHSCOOTER","INE288A01013",20.74,79.260000000000005,"No"]
[561,"MAHSEAMLES","INE271B01025",18.34,81.66,"No"]
[562,"MAITHANALL","INE683C01011",50,50,"No"]
[563,"MANAKSIA","INE015D01022",22.01,77.989999999999995,"No"]
[564,"MANALIPETC","INE201A01024",30.7,69.3,"No"]
[565,"MANAPPURAM","INE522D01027",31.69,68.31,"No"]
[566,"MANGALAM","INE584F01014",28.93,71.069999999999993,"No"]
[567,"MANGCHEFER","INE558B01017",100,0,"No"]
[568,"MANGLMCEM","INE347A01017",21.19,78.81,"No"]
[569,"MANINDS","INE993A01026",26.86,73.14,"No"]
[570,"MANINFRA","INE949H01023",26.74,73.260000000000005,"No"]
[571,"MARINE","INE01JE01028",15.07,84.93,"No"]
[572,"MARKSANS","INE750C01026",27.2,72.8,"No"]
[573,"MASFIN","INE348L01012",20.92,79.08,"No"]
[574,"MASTEK","INE759A01021",27.17,72.83,"No"]
[575,"MAXHEALTH","INE027H01010",17.690000000000001,82.31,"No"]
[576,"MAXIND","INE0CG601016",15.25,84.75,"No"]
[577,"MAXVIL","INE154U01015",23.71,76.290000000000006,"No"]
[578,"MAYURUNIQ","INE040D01038",24.65,75.349999999999994,"No"]
[579,"MAZDA","INE885E01034",21.37,78.63,"No"]
[580,"MAZDOCK","INE249Z01012",17.329999999999998,82.67,"No"]
[581,"MCX","INE745G01035",20.53,79.47,"No"]
[582,"MEGH","INE974H01013",27.9,72.099999999999994,"No"]
[583,"MENONBE","INE071D01033",24.97,75.03,"No"]
[584,"MEP","INE776I01010",30.29,69.709999999999994,"No"]
[585,"METROPOLIS","INE112L01020",20.47,79.53,"No"]
[586,"MFSL","INE180A01020",32.229999999999997,67.77,"No"]
[587,"MGL","INE002S01010",24.51,75.489999999999995,"No"]
[588,"MHRIL","INE998I01010",19.27,80.73,"No"]
[589,"MIDHANI","INE099Z01011",22.11,77.89,"No"]
[590,"MINDACORP","INE842C01021",24.99,75.010000000000005,"No"]
[591,"MINDAIND","INE405E01023",23.19,76.81,"No"]
[592,"MINDTREE","INE018I01017",21.88,78.12,"No"]
[593,"MIRZAINT","INE771A01026",23.81,76.19,"No"]
[594,"MMFL","INE227C01017",24.99,75.010000000000005,"No"]
[595,"MMTC","INE123F01029",30,70,"No"]
[596,"MOIL","INE490G01020",20.45,79.55,"No"]
[597,"MOLDTKPAC","INE893J01029",19.670000000000002,80.33,"No"]
[598,"MONTECARLO","INE950M01013",21.89,78.11,"No"]
[599,"MOREPENLAB","INE083A01026",31.54,68.459999999999994,"No"]
[600,"MOTILALOFS","INE338I01027",19.690000000000001,80.31,"No"]
[601,"MPHASIS","INE356A01018",19.850000000000001,80.150000000000006,"No"]
[602,"MPSLTD","INE943D01017",26.38,73.62,"No"]
[603,"MRPL","INE103A01014",22.92,77.08,"No"]
[604,"MSTCLTD","INE255X01014",33.700000000000003,66.3,"No"]
[605,"MTNL","INE153A01019",34.25,65.75,"No"]
[606,"MUNJALAU","INE672B01032",26.45,73.55,"No"]
[607,"MUNJALSHOW","INE577A01027",21.57,78.430000000000007,"No"]
[608,"MURUDCERA","INE692B01014",30.18,69.819999999999993,"No"]
[609,"MUTHOOTCAP","INE296G01013",23.41,76.59,"No"]
[610,"NACLIND","INE295D01020",24.5,75.5,"No"]
[611,"NAHARPOLY","INE308A01027",31.48,68.52,"No"]
[612,"NAM-INDIA","INE298J01013",23.77,76.23,"No"]
[613,"NATCOPHARM","INE987B01026",17.59,82.41,"No"]
[614,"NATHBIOGEN","INE448G01010",25.94,74.06,"No"]
[615,"NATIONALUM","INE139A01034",22.02,77.98,"No"]
[616,"NAVINFLUOR","INE048G01026",23.3,76.7,"No"]
[617,"NAVKARCORP","INE278M01019",29.73,70.27,"No"]
[618,"NAVNETEDUL","INE060A01024",18.23,81.77,"No"]
[619,"NBCC","INE095N01031",26.86,73.14,"No"]
[620,"NBVENTURES","INE725A01022",24.26,75.739999999999995,"No"]
[621,"NCC","INE868B01028",31.71,68.290000000000006,"No"]
[622,"NCLIND","INE732C01016",23.61,76.39,"No"]
[623,"NECLIFE","INE023H01027",29.2,70.8,"No"]
[624,"NELCAST","INE189I01024",28.62,71.38,"No"]
[625,"NELCO","INE045B01015",22.32,77.680000000000007,"No"]
[626,"NEOGEN","INE136S01016",24.93,75.069999999999993,"No"]
[627,"NESCO","INE317F01035",18.899999999999999,81.099999999999994,"No"]
[628,"NETWORK18","INE870H01013",23.47,76.53,"No"]
[629,"NEWGEN","INE619B01017",22.91,77.09,"No"]
[630,"NFL","INE870D01012",29.06,70.94,"No"]
[631,"NH","INE410P01011",19.11,80.89,"No"]
[632,"NHPC","INE848E01016",17.14,82.86,"No"]
[633,"NIACL","INE470Y01017",28.56,71.44,"No"]
[634,"NILKAMAL","INE310A01015",17.96,82.04,"No"]
[635,"NIPPOBATRY","INE567A01010",24.32,75.680000000000007,"No"]
[636,"NITINSPIN","INE229H01012",24.99,75.010000000000005,"No"]
[637,"NLCINDIA","INE589A01014",16.87,83.13,"No"]
[638,"NOVARTIND","INE234A01025",45.84,54.16,"No"]
[639,"NRAIL","INE740D01017",25.22,74.78,"No"]
[640,"NRBBEARING","INE349A01021",25.03,74.97,"No"]
[641,"NSIL","INE023A01030",50,50,"No"]
[642,"NUCLEUS","INE096B01018",22.98,77.02,"No"]
[643,"NXTDIGITAL","INE353A01023",21.06,78.94,"No"]
[644,"OAL","INE959C01023",27.12,72.88,"No"]
[645,"OBEROIRLTY","INE093I01010",21.79,78.209999999999994,"No"]
[646,"OCCL","INE321D01016",18.75,81.25,"No"]
[647,"OFSS","INE881D01027",17.39,82.61,"No"]
[648,"OIL","INE274J01014",20.39,79.61,"No"]
[649,"OMAXE","INE800H01010",19.829999999999998,80.17,"No"]
[650,"ORIENTABRA","INE569C01020",25.6,74.400000000000006,"No"]
[651,"ORIENTBELL","INE607D01018",28.27,71.73,"No"]
[652,"ORIENTCEM","INE876N01018",24.9,75.099999999999994,"No"]
[653,"ORIENTELEC","INE142Z01019",19.559999999999999,80.44,"No"]
[654,"ORIENTPPR","INE592A01026",26.49,73.510000000000005,"No"]
[655,"ORIENTREF","INE743M01012",50,50,"No"]
[656,"ORISSAMINE","INE725E01024",28.45,71.55,"No"]
[657,"PAGEIND","INE761H01022",19.23,80.77,"No"]
[658,"PANACEABIO","INE922B01023",69.989999999999995,30.01,"No"]
[659,"PARAGMILK","INE883N01014",24.46,75.540000000000006,"No"]
[660,"PATELENG","INE244B01030",30.22,69.78,"No"]
[661,"PDMJEPAPER","INE865T01018",25.7,74.3,"No"]
[662,"PENIND","INE932A01024",25.01,74.989999999999995,"No"]
[663,"PERSISTENT","INE262H01013",19.57,80.430000000000007,"No"]
[664,"PFC","INE134E01011",25.54,74.459999999999994,"No"]
[665,"PFIZER","INE182A01018",16.79,83.21,"No"]
[666,"PFOCUS","INE367G01038",69.989999999999995,30.01,"No"]
[667,"PFS","INE560K01014",24.81,75.19,"No"]
[668,"PGHL","INE199A01012",17.34,82.66,"No"]
[669,"PHOENIXLTD","INE211B01039",21.05,78.95,"No"]
[670,"PIIND","INE603J01030",18.41,81.59,"No"]
[671,"PILANIINVS","INE417C01014",19.04,80.959999999999994,"No"]
[672,"PIONDIST","INE889E01010",19.239999999999998,80.760000000000005,"No"]
[673,"PITTIENG","INE450D01021",25.97,74.03,"No"]
[674,"PLASTIBLEN","INE083C01022",23.61,76.39,"No"]
[675,"PNBGILTS","INE859A01011",23.29,76.709999999999994,"No"]
[676,"PNBHOUSING","INE572E01012",23.29,76.709999999999994,"No"]
[677,"PNCINFRA","INE195J01029",21.81,78.19,"No"]
[678,"PODDARMENT","INE371C01013",22.8,77.2,"No"]
[679,"POLYCAB","INE455K01017",18.309999999999999,81.69,"No"]
[680,"POWERINDIA","INE07Y701011",17.21,82.79,"No"]
[681,"POWERMECH","INE211R01019",23.49,76.510000000000005,"No"]
[682,"PPAP","INE095I01015",24.67,75.33,"No"]
[683,"PPL","INE050001010",27.33,72.67,"No"]
[684,"PRABHAT","INE302M01033",22.68,77.319999999999993,"No"]
[685,"PRAJIND","INE074A01025",26.77,73.23,"No"]
[686,"PRAKASH","INE603A01013",32.81,67.19,"No"]
[687,"PRECAM","INE484I01029",26.56,73.44,"No"]
[688,"PRECWIRE","INE372C01029",24.3,75.7,"No"]
[689,"PRESTIGE","INE811K01011",25.16,74.84,"No"]
[690,"PRICOLLTD","INE726V01018",26.49,73.510000000000005,"No"]
[691,"PRINCEPIPE","INE689W01016",24.92,75.08,"No"]
[692,"PRIVISCL","INE959A01019",22.97,77.03,"No"]
[693,"PROZONINTU","INE195N01013",24.48,75.52,"No"]
[694,"PSB","INE608A01012",26.63,73.37,"No"]
[695,"PSPPROJECT","INE488V01015",17.41,82.59,"No"]
[696,"PTC","INE877F01012",18.96,81.040000000000006,"No"]
[697,"PTL","INE034D01031",17.809999999999999,82.19,"No"]
[698,"PURVA","INE323I01011",27.11,72.89,"No"]
[699,"PVR","INE191H01014",43.44,56.56,"No"]
[700,"QUESS","INE615P01015",100,0,"No"]
[701,"QUICKHEAL","INE306L01010",26.29,73.709999999999994,"No"]
[702,"RADICO","INE944F01028",20.94,79.06,"No"]
[703,"RADIOCITY","INE919I01024",20.68,79.319999999999993,"No"]
[704,"RAILTEL","INE0DD101019",17.32,82.68,"No"]
[705,"RAIN","INE855B01025",27.18,72.819999999999993,"No"]
[706,"RAJESHEXPO","INE343B01030",15.79,84.21,"No"]
[707,"RAJRATAN","INE451D01011",21.84,78.16,"No"]
[708,"RALLIS","INE613A01020",19.28,80.72,"No"]
[709,"RAMCOCEM","INE331A01037",16.940000000000001,83.06,"No"]
[710,"RAMCOIND","INE614A01028",20.32,79.680000000000007,"No"]
[711,"RAMCOSYS","INE246B01019",29.34,70.66,"No"]
[712,"RANASUG","INE625B01014",29.64,70.36,"No"]
[713,"RANEENGINE","INE222J01013",25.84,74.16,"No"]
[714,"RANEHOLDIN","INE384A01010",26.49,73.510000000000005,"No"]
[715,"RATNAMANI","INE703B01027",16.809999999999999,83.19,"No"]
[716,"RAYMOND","INE301A01014",21.3,78.7,"No"]
[717,"RBL","INE244J01017",22.49,77.510000000000005,"No"]
[718,"RBLBANK","INE976G01028",29.84,70.16,"No"]
[719,"RCF","INE027A01015",27.13,72.87,"No"]
[720,"RECLTD","INE020B01018",20.07,79.930000000000007,"No"]
[721,"REDINGTON","INE891D01026",28,72,"No"]
[722,"RELAXO","INE131B01039",15.81,84.19,"No"]
[723,"RELIGARE","INE621H01010",50,50,"No"]
[724,"RELINFRA","INE036A01016",34.020000000000003,65.98,"No"]
[725,"RENUKA","INE087H01022",69.989999999999995,30.01,"No"]
[726,"REPCOHOME","INE612J01015",100,0,"No"]
[727,"REPRO","INE461B01014",20.77,79.23,"No"]
[728,"RESPONIND","INE688D01026",21.54,78.459999999999994,"No"]
[729,"RGL","INE722H01016",50,50,"No"]
[730,"RICOAUTO","INE209B01025",29.69,70.31,"No"]
[731,"RIIL","INE046A01015",21.92,78.08,"No"]
[732,"RITES","INE320J01015",16.23,83.77,"No"]
[733,"RKFORGE","INE399G01015",26.79,73.209999999999994,"No"]
[734,"RML","INE050H01012",30.8,69.2,"No"]
[735,"ROHLTD","INE283H01019",26.98,73.02,"No"]
[736,"ROSSARI","INE02A801020",16.38,83.62,"No"]
[737,"ROSSELLIND","INE847C01020",24.4,75.599999999999994,"No"]
[738,"ROUTE","INE450U01017",23.5,76.5,"No"]
[739,"RPGLIFE","INE105J01010",23.81,76.19,"No"]
[740,"RPPINFRA","INE324L01013",34.39,65.61,"No"]
[741,"RSYSTEMS","INE411H01032",23.99,76.010000000000005,"No"]
[742,"RUCHIRA","INE803H01014",26.2,73.8,"No"]
[743,"RUPA","INE895B01021",24.43,75.569999999999993,"No"]
[744,"RUSHIL","INE573K01017",31.53,68.47,"No"]
[745,"RVNL","INE415G01027",23.96,76.040000000000006,"No"]
[746,"SADBHAV","INE226H01026",69.989999999999995,30.01,"No"]
[747,"SADBHIN","INE764L01010",30.22,69.78,"No"]
[748,"SAFARI","INE429E01023",20.85,79.150000000000006,"No"]
[749,"SAGCEM","INE229C01013",22.92,77.08,"No"]
[750,"SAIL","INE114A01011",59.89,40.11,"No"]
[751,"SAKAR","INE732S01012",25.01,74.989999999999995,"No"]
[752,"SAKSOFT","INE667G01015",29.46,70.540000000000006,"No"]
[753,"SAKUMA","INE190H01024",28.41,71.59,"No"]
[754,"SALASAR","INE170V01019",100,0,"No"]
[755,"SALZERELEC","INE457F01013",27.49,72.510000000000005,"No"]
[756,"SANDHAR","INE278H01035",18.829999999999998,81.17,"No"]
[757,"SANGHIIND","INE999B01013",69.989999999999995,30.01,"No"]
[758,"SANGHVIMOV","INE989A01024",28.22,71.78,"No"]
[759,"SANOFI","INE058A01010",12.79,87.21,"No"]
[760,"SARLAPOLY","INE453D01025",29.5,70.5,"No"]
[761,"SASKEN","INE231F01020",22.22,77.78,"No"]
[762,"SASTASUNDR","INE019J01013",27.28,72.72,"No"]
[763,"SATIA","INE170E01023",21.92,78.08,"No"]
[764,"SCHAEFFLER","INE513A01014",14.35,85.65,"No"]
[765,"SCHNEIDER","INE839M01018",24.54,75.459999999999994,"No"]
[766,"SCI","INE109A01011",28.84,71.16,"No"]
[767,"SEAMECLTD","INE497B01018",23.39,76.61,"No"]
[768,"SELAN","INE818A01017",22.57,77.430000000000007,"No"]
[769,"SESHAPAPER","INE630A01024",22.98,77.02,"No"]
[770,"SFL","INE916U01025",16.399999999999999,83.6,"No"]
[771,"SHAKTIPUMP","INE908D01010",27.41,72.59,"No"]
[772,"SHALBY","INE597J01018",25.47,74.53,"No"]
[773,"SHALPAINTS","INE849C01026",26.12,73.88,"No"]
[774,"SHANKARA","INE274V01019",29.67,70.33,"No"]
[775,"SHANTIGEAR","INE631A01022",22.68,77.319999999999993,"No"]
[776,"SHARDACROP","INE221J01015",23.52,76.48,"No"]
[777,"SHEMAROO","INE363M01019",30.05,69.95,"No"]
[778,"SHILPAMED","INE790G01031",23.7,76.3,"No"]
[779,"SHK","INE500L01026",24.28,75.72,"No"]
[780,"SHOPERSTOP","INE498B01024",22.72,77.28,"No"]
[781,"SHREDIGCEM","INE232A01011",25.57,74.430000000000007,"No"]
[782,"SHREEPUSHK","INE712K01011",26.17,73.83,"No"]
[783,"SHREYANIND","INE231C01019",27.38,72.62,"No"]
[784,"SHRIRAMCIT","INE722A01011",21.39,78.61,"No"]
[785,"SIMPLEXINF","INE059B01024",25.61,74.39,"No"]
[786,"SIS","INE285J01028",19.670000000000002,80.33,"No"]
[787,"SIYSIL","INE076B01028",24.81,75.19,"No"]
[788,"SJVN","INE002L01015",14.99,85.01,"No"]
[789,"SKFINDIA","INE640A01023",17.8,82.2,"No"]
[790,"SKIPPER","INE439E01022",29.44,70.56,"No"]
[791,"SKMEGGPROD","INE411D01015",26.08,73.92,"No"]
[792,"SMARTLINK","INE178C01020",24,76,"No"]
[793,"SMLISUZU","INE294B01019",22.38,77.62,"No"]
[794,"SMSLIFE","INE320X01016",50,50,"No"]
[795,"SMSPHARMA","INE812G01025",25.09,74.91,"No"]
[796,"SNOWMAN","INE734N01019",30.6,69.400000000000006,"No"]
[797,"SOBHA","INE671H01015",26.28,73.72,"No"]
[798,"SOLARA","INE624Z01016",27.24,72.760000000000005,"No"]
[799,"SOLARINDS","INE343H01029",14.45,85.55,"No"]
[800,"SONATSOFTW","INE269A01021",100,0,"No"]
[801,"SOTL","INE035D01012",19.11,80.89,"No"]
[802,"SOUTHBANK","INE683A01023",23.76,76.239999999999995,"No"]
[803,"SPAL","INE212I01016",29.17,70.83,"No"]
[804,"SPANDANA","INE572J01011",22.68,77.319999999999993,"No"]
[805,"SPARC","INE232I01014",23.66,76.34,"No"]
[806,"SPECIALITY","INE247M01014",27.3,72.7,"No"]
[807,"SPENCERS","INE020801028",25,75,"No"]
[808,"SPIC","INE147A01011",28.42,71.58,"No"]
[809,"SPICEJET","INE285B01017",69.989999999999995,30.01,"No"]
[810,"SREEL","INE099F01013",20.39,79.61,"No"]
[811,"SREINFRA","INE872A01014",34.78,65.22,"No"]
[812,"SRF","INE647A01010",23.9,76.099999999999994,"No"]
[813,"SRIPIPES","INE943C01027",25.17,74.83,"No"]
[814,"SRTRANSFIN","INE721A01013",29.57,70.430000000000007,"No"]
[815,"SSWL","INE802C01017",69.989999999999995,30.01,"No"]
[816,"STAR","INE939A01011",26.5,73.5,"No"]
[817,"STARCEMENT","INE460H01021",19.22,80.78,"No"]
[818,"STARPAPER","INE733A01018",25.6,74.400000000000006,"No"]
[819,"STCINDIA","INE655A01013",27.14,72.86,"No"]
[820,"STEELXIND","INE503B01013",100,0,"No"]
[821,"STERTOOLS","INE334A01023",22.81,77.19,"No"]
[822,"STOVEKRAFT","INE00IN01015",13.33,86.67,"No"]
[823,"SUBEXLTD","INE754A01055",50,50,"No"]
[824,"SUBROS","INE287B01021",24.04,75.959999999999994,"No"]
[825,"SUDARSCHEM","INE659A01023",20.04,79.959999999999994,"No"]
[826,"SUMICHEM","INE258G01013",18.34,81.66,"No"]
[827,"SUMMITSEC","INE519C01017",17.239999999999998,82.76,"No"]
[828,"SUNDARMFIN","INE660A01013",19.760000000000002,80.239999999999995,"No"]
[829,"SUNDARMHLD","INE202Z01029",21.51,78.489999999999995,"No"]
[830,"SUNDRMFAST","INE387A01021",19.399999999999999,80.599999999999994,"No"]
[831,"SUNFLAG","INE947A01014",29.17,70.83,"No"]
[832,"SUNTECK","INE805D01034",23.7,76.3,"No"]
[833,"SUNTV","INE424H01027",40.659999999999997,59.34,"No"]
[834,"SUPERHOUSE","INE712B01010",27.12,72.88,"No"]
[835,"SUPRAJIT","INE399C01030",20.87,79.13,"No"]
[836,"SUPREMEIND","INE195A01028",18.8,81.2,"No"]
[837,"SURYAROSNI","INE335A01012",27,73,"No"]
[838,"SUTLEJTEX","INE645H01027",27.14,72.86,"No"]
[839,"SUVEN","INE495B01038",100,0,"No"]
[840,"SWANENERGY","INE665A01038",19.14,80.86,"No"]
[841,"SWARAJENG","INE277A01016",16.14,83.86,"No"]
[842,"SWSOLAR","INE00M201021",31.87,68.13,"No"]
[843,"SYMPHONY","INE225D01027",20.84,79.16,"No"]
[844,"SYNGENE","INE398R01022",16.79,83.21,"No"]
[845,"TAJGVK","INE586B01026",23.36,76.64,"No"]
[846,"TAKE","INE142I01023",26.26,73.739999999999995,"No"]
[847,"TALBROAUTO","INE187D01011",27.61,72.39,"No"]
[848,"TARC","INE0EK901012",19.309999999999999,80.69,"No"]
[849,"TASTYBITE","INE488B01017",20.98,79.02,"No"]
[850,"TATACHEM","INE092A01019",19.78,80.22,"No"]
[851,"TATACOFFEE","INE493A01027",20.170000000000002,79.83,"No"]
[852,"TATACOMM","INE151A01013",22.84,77.16,"No"]
[853,"TATAELXSI","INE670A01012",100,0,"No"]
[854,"TATAINVEST","INE672A01018",16.88,83.12,"No"]
[855,"TATAMETALI","INE056C01010",23.94,76.06,"No"]
[856,"TATAPOWER","INE245A01021",23.84,76.16,"No"]
[857,"TATASTLBSL","INE824B01021",100,0,"No"]
[858,"TCI","INE688A01022",19.95,80.05,"No"]
[859,"TCIEXP","INE586V01016",18.850000000000001,81.150000000000006,"No"]
[860,"TCNSBRANDS","INE778U01029",22.13,77.87,"No"]
[861,"TCPLPACK","INE822C01015",26.27,73.73,"No"]
[862,"TDPOWERSYS","INE419M01019",22.18,77.819999999999993,"No"]
[863,"TEAMLEASE","INE985S01024",20.46,79.540000000000006,"No"]
[864,"TECHNOE","INE285K01026",23.24,76.760000000000005,"No"]
[865,"TEXINFRA","INE435C01024",26.24,73.760000000000005,"No"]
[866,"TEXMOPIPES","INE141K01013",31.02,68.98,"No"]
[867,"TEXRAIL","INE621L01012",26.06,73.94,"No"]
[868,"TFCILTD","INE305A01015",24.59,75.41,"No"]
[869,"THANGAMAYL","INE085J01014",24.19,75.81,"No"]
[870,"THEMISMED","INE083B01016",23.75,76.25,"No"]
[871,"THERMAX","INE152A01029",18.170000000000002,81.83,"No"]
[872,"THOMASCOOK","INE332A01027",28.23,71.77,"No"]
[873,"THYROCARE","INE594H01019",21.63,78.37,"No"]
[874,"TI","INE133E01013",50,50,"No"]
[875,"TIDEWATER","INE484C01022",13.26,86.74,"No"]
[876,"TIIL","INE545H01011",25.61,74.39,"No"]
[877,"TIMETECHNO","INE508G01029",25.42,74.58,"No"]
[878,"TIMKEN","INE325A01013",20.22,79.78,"No"]
[879,"TINPLATE","INE422C01014",24.92,75.08,"No"]
[880,"TIRUMALCHM","INE338A01024",27.49,72.510000000000005,"No"]
[881,"TNPETRO","INE148A01019",24.43,75.569999999999993,"No"]
[882,"TNPL","INE107A01015",19,81,"No"]
[883,"TORNTPOWER","INE813H01021",16.95,83.05,"No"]
[884,"TRENT","INE849A01020",22.05,77.95,"No"]
[885,"TRITURBINE","INE152M01016",24,76,"No"]
[886,"TRIVENI","INE256C01024",23.83,76.17,"No"]
[887,"TTKHLTCARE","INE910C01018",22.13,77.87,"No"]
[888,"TTKPRESTIG","INE690A01010",18.77,81.23,"No"]
[889,"TV18BRDCST","INE886H01027",26.32,73.680000000000007,"No"]
[890,"TVSMOTOR","INE494B01023",19.52,80.48,"No"]
[891,"TVSSRICHAK","INE421C01016",21.68,78.319999999999993,"No"]
[892,"TVTODAY","INE038F01029",20.12,79.88,"No"]
[893,"TWL","INE615H01020",25.56,74.44,"No"]
[894,"UCALFUEL","INE139B01016",24.47,75.53,"No"]
[895,"UCOBANK","INE691A01018",20.83,79.17,"No"]
[896,"UFLEX","INE516A01017",21.59,78.41,"No"]
[897,"UFO","INE527H01019",22.31,77.69,"No"]
[898,"UGARSUGAR","INE071E01023",24.21,75.790000000000006,"No"]
[899,"UJJIVAN","INE334L01012",24.33,75.67,"No"]
[900,"UJJIVANSFB","INE551W01018",20.48,79.52,"No"]
[901,"UNIDT","INE961D01019",18.57,81.430000000000007,"No"]
[902,"UNIONBANK","INE692A01016",22.18,77.819999999999993,"No"]
[903,"UNIVCABLES","INE279A01012",25.32,74.680000000000007,"No"]
[904,"USHAMART","INE228A01035",28.98,71.02,"No"]
[905,"UTIAMC","INE094J01016",12.5,87.5,"No"]
[906,"UTTAMSUGAR","INE786F01031",26.21,73.790000000000006,"No"]
[907,"VADILALIND","INE694D01016",19.43,80.569999999999993,"No"]
[908,"VALIANTORG","INE565V01010",16.88,83.12,"No"]
[909,"VARDHACRLC","INE116G01013",18.8,81.2,"No"]
[910,"VARROC","INE665L01035",25.13,74.87,"No"]
[911,"VBL","INE200M01013",18.97,81.03,"No"]
[912,"VENKEYS","INE398A01010",23.56,76.44,"No"]
[913,"VESUVIUS","INE386A01015",17.61,82.39,"No"]
[914,"VETO","INE918N01018",29.96,70.040000000000006,"No"]
[915,"VGUARD","INE951I01027",16.84,83.16,"No"]
[916,"VIDHIING","INE632C01026",50,50,"No"]
[917,"VIMTALABS","INE579C01029",50,50,"No"]
[918,"VINATIORGA","INE410B01037",20.89,79.11,"No"]
[919,"VINDHYATEL","INE707A01012",23.11,76.89,"No"]
[920,"VINYLINDIA","INE250B01029",26.18,73.819999999999993,"No"]
[921,"VIPIND","INE054A01027",20.93,79.069999999999993,"No"]
[922,"VISAKAIND","INE392A01013",24.88,75.12,"No"]
[923,"VLSFINANCE","INE709A01018",23.96,76.040000000000006,"No"]
[924,"VMART","INE665J01013",21.56,78.44,"No"]
[925,"VOLTAMP","INE540H01012",19.27,80.73,"No"]
[926,"VOLTAS","INE226A01021",17.48,82.52,"No"]
[927,"VRLLOG","INE366I01010",19.79,80.209999999999994,"No"]
[928,"VSSL","INE050M01012",23.92,76.08,"No"]
[929,"VSTIND","INE710A01016",14,86,"No"]
[930,"VSTTILLERS","INE764D01017",19.98,80.02,"No"]
[931,"VTL","INE825A01012",17.27,82.73,"No"]
[932,"WABAG","INE956G01038",27.67,72.33,"No"]
[933,"WABCOINDIA","INE342J01019",16.98,83.02,"No"]
[934,"WALCHANNAG","INE711A01022",25.76,74.239999999999995,"No"]
[935,"WATERBASE","INE054C01015",24.77,75.23,"No"]
[936,"WELCORP","INE191B01025",24.68,75.319999999999993,"No"]
[937,"WELENT","INE625G01013",26.48,73.52,"No"]
[938,"WELSPUNIND","INE192B01031",26.74,73.260000000000005,"No"]
[939,"WENDT","INE274C01019",22.16,77.84,"No"]
[940,"WESTLIFE","INE274F01020",20.23,79.77,"No"]
[941,"WHEELS","INE715A01015",19.36,80.64,"No"]
[942,"WHIRLPOOL","INE716A01013",18.29,81.709999999999994,"No"]
[943,"WOCKPHARMA","INE049B01025",26.34,73.66,"No"]
[944,"WONDERLA","INE066O01014",20.18,79.819999999999993,"No"]
[945,"WSTCSTPAPR","INE976A01021",24.14,75.86,"No"]
[946,"XCHANGING","INE692G01013",24.64,75.36,"No"]
[947,"ZEEL","INE256A01028",38.99,61.01,"No"]
[948,"ZEELEARN","INE565L01011",24.82,75.180000000000007,"No"]
[949,"ZODIACLOTH","INE206B01013",21.48,78.52,"No"]
[950,"ZOTA","INE358U01012",15.71,84.29,"No"]
[951,"ZUARI","INE840M01016",27.17,72.83,"No"]
[952,"ZYDUSWELL","INE768C01010",15.02,84.98,"No"]
[]
[]
[]
[]
[]
[]
[]
[]
["List of ETFs"]
["Sr. No.","Security Name","ISIN","Haircut %","For every Rs 100 worth of stock pledged, you'll receive collateral margin of Rs.","Member wise limit reached"]
[1,"AXISBNKETF","INF846K01X63",12.5,87.5,"No"]
[2,"AXISGOLD","INF846K01W80",12.5,87.5,"No"]
[3,"AXISNIFTY","INF846K01W98",13.5,86.5,"No"]
[4,"BANKBEES","INF204KB15I9",17.25,82.75,"No"]
[5,"BSLGOLDETF","INF209K01HT2",12.5,87.5,"No"]
[6,"BSLNIFTY","INF209K01IR4",13.13,86.87,"No"]
[7,"CPSEETF","INF457M01133",14.45,85.55,"No"]
[8,"EBBETF0423","INF754K01KN4",8,92,"No"]
[9,"EBBETF0425","INF754K01LD3",8,92,"No"]
[10,"EBBETF0430","INF754K01KO2",8,92,"No"]
[11,"EBBETF0431","INF754K01LE1",8,92,"No"]
[12,"GOLDBEES","INF204KB17I5",12.5,87.5,"No"]
[13,"HBANKETF","INF179KC1AN8",12.5,87.5,"No"]
[14,"HDFCMFGETF","INF179KC1981",12.5,87.5,"No"]
[15,"HDFCNIFETF","INF179KC1965",11.57,88.43,"No"]
[16,"HDFCSENETF","INF179KC1973",13.27,86.73,"No"]
[17,"ICICI500","INF109KC1CZ3",12.72,87.28,"No"]
[18,"ICICIALPLV","INF109KC1N59",12.5,87.5,"No"]
[19,"ICICIB22","INF109KB15Y7",13.66,86.34,"No"]
[20,"ICICIBANKN","INF109KC1E27",15.27,84.73,"No"]
[21,"ICICIBANKP","INF109KC1E35",17.41,82.59,"No"]
[22,"ICICIGOLD","INF109KC1NT3",12.5,87.5,"No"]
[23,"ICICILOVOL","INF109KB10T8",12.5,87.5,"No"]
[24,"ICICIM150","INF109KC1G82",13.92,86.08,"No"]
[25,"ICICIMCAP","INF109KB1XT3",12.23,87.77,"No"]
[26,"ICICINF100","INF109KA1962",13.36,86.64,"No"]
[27,"ICICINIFTY","INF109K012R6",11.37,88.63,"No"]
[28,"ICICINV20","INF109KB1WY5",13.6,86.4,"No"]
[29,"ICICINXT50","INF109KC1NS5",11.22,88.78,"No"]
[30,"ICICISENSX","INF346A01034",10.6,89.4,"No"]
[31,"ICICITECH","INF109KC1N67",12.5,87.5,"No"]
[32,"IDBIGOLD","INF397L01554",13.25,86.75,"No"]
[33,"INFRABEES","INF732E01268",13.63,86.37,"No"]
[34,"IVZINGOLD","INF205K01361",13.04,86.96,"No"]
[35,"JUNIORBEES","INF732E01045",10.199999999999999,89.8,"No"]
[36,"KOTAKBKETF","INF174K01F59",17.489999999999998,82.51,"No"]
[37,"KOTAKGOLD","INF373I01049",12.5,87.5,"No"]
[38,"KOTAKIT","INF174KA1GC5",12.5,87.5,"No"]
[39,"KOTAKNIFTY","INF174K014P6",10.48,89.52,"No"]
[40,"KOTAKNV20","INF174K01Z71",12.5,87.5,"No"]
[41,"KOTAKPSUBK","INF373I01023",19.96,80.040000000000006,"No"]
[42,"M100","INF247L01023",11.13,88.87,"No"]
[43,"M50","INF247L01536",11.8,88.2,"No"]
[44,"MAESGETF","INF769K01GS9",12.5,87.5,"No"]
[45,"MAN50ETF","INF769K01EG9",12.19,87.81,"No"]
[46,"N100","INF247L01031",12.76,87.24,"No"]
[47,"NCPSESDL24","INF204KB18W4",12.5,87.5,"No"]
[48,"NETFIT","INF204KB15V2",12.5,87.5,"No"]
[49,"NETFMID150","INF204KB1V68",13.6,86.4,"No"]
[50,"NETFNV20","INF204KB18I3",15.42,84.58,"No"]
[51,"NIFTYBEES","INF204KB14I2",11.63,88.37,"No"]
[52,"PSUBNKBEES","INF204KB16I7",20.37,79.63,"No"]
[53,"QGOLDHALF","INF082J01010",12.5,87.5,"No"]
[54,"QNIFTY","INF082J01028",10.47,89.53,"No"]
[55,"SBIETFIT","INF200KA1S14",12.5,87.5,"No"]
[56,"SBIETFPB","INF200KA1S22",17.43,82.57,"No"]
[57,"SBIETFQLTY","INF200KA1WX6",12.5,87.5,"No"]
[58,"SETFGOLD","INF200K01099",12.5,87.5,"No"]
[59,"SETFNIF50","INF200KA1FS1",10.71,89.29,"No"]
[60,"SETFNIFBK","INF200KA1580",16.79,83.21,"No"]
[61,"SETFNN50","INF200KA1598",10.46,89.54,"No"]
[62,"SHARIABEES","INF732E01128",16.57,83.43,"No"]
[63,"UTIBANKETF","INF789F1AUV1",14.03,85.97,"No"]
[64,"UTINIFTETF","INF789FB1X41",11.82,88.18,"No"]
[65,"UTISENSETF","INF789FB1X58",12.83,87.17,"No"]
[]
[]
["Mutual Funds (OMF) forming part of Non-cash component."]
["Sr. No.","Security Name","ISIN","Scheme Name","Haircut % As on 01/12/2020","For every Rs 100 worth of stock pledged, you'll receive collateral margin of Rs."]
[1,"AEFDP","INF846K01172","Axis Bluechip Fund -Regular Plan - Dividend",7.5,92.5]
[2,"AEFDR","INF846K01180","Axis Bluechip Fund -Regular Plan - Dividend -Reinvestment",7.5,92.5]
[3,"AEFGR","INF846K01164","Axis Bluechip Fund -Regular Plan - Growth",7.5,92.5]
[4,"ARDG","INF754K01BS2","Edelweiss Balance Advantage Fund - Direct Plan Growth Option",7.5,92.5]
[5,"ASTFIGR","INF846K01644","Axis Short Term Fund -Regular Plan - Growth Option",7.5,92.5]
[6,"ASTFIMDP","INF846K01651","Axis Short Term Fund -Regular Plan - Monthly Dividend Option",7.5,92.5]
[7,"ASTFIMDR","INF846K01669","Axis Short Term Fund -Regular Plan - Monthly Dividend Option -Reinvestment",7.5,92.5]
[8,"ATDD","INF754K01EB2","EDELWEISS ARBITRAGE FUND - DIRECT PLAN DIVIDEND PAYOUT OPTION",7.5,92.5]
[9,"ATDD","INF754K01EC0","EDELWEISS ARBITRAGE- DIRECT DIVIDEND REINVESTMENT",7.5,92.5]
[10,"ATDG","INF754K01EA4","EDELWEISS ARBITRAGE DIRECT GROWTH OPTION",7.5,92.5]
[11,"ATDPD","INF754K01EG1","EDELWEISS ARBITRAGE FUND DIVIDEND PAYOUT OPTION",7.5,92.5]
[12,"ATDPR","INF754K01EH9","EDELWEISS ARBITRAGE FUND DIVIDEND REINVESTMENT OPTION",7.5,92.5]
[13,"ATGPG","INF754K01EF3","EDELWEISS ARBITRAGE FUND GROWTH OPTION",7.5,92.5]
[14,"AXISAFD1","INF846K01CO3","AXIS FOCUSED 25 FUNDDIRECT DIVIDEND",7.5,92.5]
[15,"AXISAFD1","INF846K01CP0","AXIS FOCUSED 25 FUNDDIRECT DIVIDEND",7.5,92.5]
[16,"AXISAFDG","INF846K01CQ8","AXIS FOCUSED 25 FUNDDIRECT GROWTH",7.5,92.5]
[17,"AXISAFDP","INF846K01CI5","AXIS FOCUSED 25 FUND DIVIDEND PAYOUT",7.5,92.5]
[18,"AXISAFDP","INF846K01CJ3","AXIS FOCUSED 25 FUND DIVIDEND REINVESTMENT",7.5,92.5]
[19,"AXISAFGP","INF846K01CH7","AXIS FOCUSED 25 FUND GROWTH",7.5,92.5]
[20,"AXISBDDG","INF846K01CR6","AXIS BANKING & PSU DEBT FUNDDIRECT GROWTH",7.5,92.5]
[21,"AXISBDGP","INF846K01CB0","Axis Banking & Psu Debt Fund -Regular Growth",7.5,92.5]
[22,"AXISCDPD","INF846K01K19","Axis Small Cap Fund-Regular Plan Dividend Payout",7.5,92.5]
[23,"AXISDEDGG","INF846K01A29","Axis Dynamic Equity Fund Direct Growth",7.5,92.5]
[24,"AXISEAD1D","INF846K01QA2","Axis Arbitrage Fund - Direct Plan - Dividend",7.5,92.5]
[25,"AXISEAD1R","INF846K01QB0","Axis Arbitrage Fund - Direct Plan - Dividend Reinvestment",7.5,92.5]
[26,"AXISEADG","INF846K01PZ1","Axis Arbitrage Fund - Direct Plan - Growth",7.5,92.5]
[27,"AXISEADPD","INF846K01QD6","Axis Arbitrage Fund - Regular Plan - Dividend",7.5,92.5]
[28,"AXISEADPR","INF846K01QE4","Axis Arbitrage Fund - Regular Plan - Dividend Reinvestment",7.5,92.5]
[29,"AXISEAGPG","INF846K01QC8","Axis Arbitrage Fund - Regular Plan - Growth",7.5,92.5]
[30,"AXISEFD1","INF846K01DN3","Axis Bluechip Fund - Direct Plan -Dividend",7.5,92.5]
[31,"AXISEFD1","INF846K01DO1","Axis Bluechip Fund - Direct Plan -Dividend Reinvestment",7.5,92.5]
[32,"AXISEFDG","INF846K01DP8","Axis Bluechip Fund - Direct Plan - Growth",7.5,92.5]
[33,"AXISMCD1","INF846K01EF7","AXIS MID CAP FUNDDIRECT DIVIDEND",7.5,92.5]
[34,"AXISMCD1","INF846K01EG5","AXIS MID CAP FUNDDIRECT DIVIDEND",7.5,92.5]
[35,"AXISMCDG","INF846K01EH3","AXIS MID CAP FUNDDIRECT GROWTH",7.5,92.5]
[36,"AXISMCDP","INF846K01867","AXIS MIDCAP FUND DIVIDEND",7.5,92.5]
[37,"AXISMCDPR","INF846K01875","AXIS MIDCAP FUND DIVIDEND",7.5,92.5]
[38,"AXISMCGP","INF846K01859","AXIS MIDCAP FUND GROWTH",7.5,92.5]
[39,"AXISSCD1R","INF846K01K50","Axis Small Cap FundDirect DividendReinvestment",7.5,92.5]
[40,"AXISSCDGG","INF846K01K35","Axis Small Cap FundDirect GrowthGrowth",7.5,92.5]
[41,"AXISSCGPG","INF846K01K01","Axis Small Cap FundRegular GrowthGrowth",7.5,92.5]
[42,"AXISSTDG","INF846K01EI1","AXIS SHORT TERM FUNDDIRECT GROWTH",7.5,92.5]
[43,"AXISSTRDR","INF846K01RK9","AXIS SHORT TERM FUND REGULAR DIVIDEND REINVESTMENT",7.5,92.5]
[44,"AXISTADG","INF846K01EN1","AXIS TREASURY ADVANTAGE FUNDDIRECT GROWTH",7.5,92.5]
[45,"AXISUSDGG","INF846K01F40","Axis Ultra Short Term Direct Growth",7.5,92.5]
[46,"AXISUSGPG","INF846K01G23","Axis Ultra Short Term Fund -Regular Plan Growth",7.5,92.5]
[47,"AXISUSRDR","INF846K01G80","AXIS ULTRA SHORT TERM FUND-REGULAR DIV REINVESTMENT",7.5,92.5]
[48,"B105G","INF084M01AB8","Aditya Birla Sun Life Balanced Advantage Fund-Growth",7.5,92.5]
[49,"B106D","INF084M01AD4","Aditya Birla Sun Life Balanced Advantage Fund-Dividend",7.5,92.5]
[50,"B106DP","INF084M01AC6","Aditya Birla Sun Life Balanced Advantage Fund-Dividend Payout",7.5,92.5]
[51,"B1180B","INF209K011W7","ADITYA BIRLA SUN LIFE BANKING AND FINANCIAL SERVICES FUND Reg GROWTH",7.5,92.5]
[52,"B1180X","INF209K013W3","Aditya Birla Sun Life Banking And Financial Services Fund - Div. DIRECT",7.5,92.5]
[53,"B1180Y","INF209K014W1","ADITYA BIRLA SUN LIFE BANKING AND FINANCIAL SERVIC",7.5,92.5]
[54,"B1180Z","INF209K015W8","Aditya Birla Sun Life Banking And Fin Serv Fund-Div. Reinv. DIRECT",7.5,92.5]
[55,"B132G","INF209K01LZ1","ADITYA BIRLA SUN LIFE SAVINGS FUND REGULAR GROWTH",7.5,92.5]
[56,"B132GZ","INF209K01UR9","Aditya Birla Sun Life Savings Fund - Growth-Direct",7.5,92.5]
[57,"B152GZ","INF209K01UX7","Aditya Birla Sun Life Floating Rate Fund - Long Term - Growth-Direct",7.5,92.5]
[58,"B152IG","INF209K01MG9","ADITYA BIRLA SUN LIFE FLOATING RATE LONG TERM GROWTH",7.5,92.5]
[59,"B201GZ","INF209K01VH8","Aditya Birla Sun Life Equity Advantage Fund - Growth-Direct Plan",7.5,92.5]
[60,"B201RZ","INF209K01VI6","Aditya Birla Sun Life Equity Advantage Fund - Dividend Reinvest-Direct Plan",7.5,92.5]
[61,"B205DZ","INF209K01P80","Aditya Birla Sun Life Arbitrage Fund - Dividend-Direct Plan",7.5,92.5]
[62,"B205GZ","INF209K01VP1","Aditya Birla Sun Life Arbitrage Fund - Growth-Direct Plan",7.5,92.5]
[63,"B205RZ","INF209K01VQ9","Aditya Birla Sun Life Arbitrage Fund -Dividend Reinvest-Direct Plan",7.5,92.5]
[64,"B221RZ","INF209K01VU1","Birla Sun Life MNC Fund - Dividend Reinvest-Direct",7.5,92.5]
[65,"B291GZ","INF209K01WC7","Aditya Birla Sun Life India GenNext Fund - Growth-Direct",7.5,92.5]
[66,"B292DZ","INF209K01Q71","Aditya Birla Sun Life Focused Equity Fund - Dividend-Direct Plan",7.5,92.5]
[67,"B292GZ","INF209K01WE3","ADITYA BIRLA SUN LIFE FOCUSED EQUITY FUND - GROWTH",7.5,92.5]
[68,"B292RZ","INF209K01WF0","Aditya Birla Sun Life Focused Equity Fund - Dividend Reinvest-Direct Plan",7.5,92.5]
[69,"B295D","INF209K01EO0","Aditya Birla Sun Life Small Cap Fund Dividend-Regular Plan",7.5,92.5]
[70,"B295DR","INF209K01EP7","Aditya Birla Sun Life Small Cap Fund Dividend Reinvest-Regular Plan",7.5,92.5]
[71,"B295G","INF209K01EN2","Aditya Birla Sun Life Small Cap Fund Growth-Regular Plan",7.5,92.5]
[72,"B295GZ","INF209K01WN4","Aditya Birla Sun Life Small Cap Fund Growth-Direct Plan",7.5,92.5]
[73,"B296D","INF209K01LE6","ADITYA BIRLA SUN LIFE PURE VALUE FUND- DIVIDEND PAYOUT",7.5,92.5]
[74,"B296G","INF209K01LF3","ADITYA BIRLA SUN LIFE PURE VALUE FUND- GROWTH",7.5,92.5]
[75,"B296GZ","INF209K01WQ7","Aditya Birla Sun Life Pure Value Fund - Growth-Direct",7.5,92.5]
[76,"B296RD","INF209K01LG1","ADITYA BIRLA SUN LIFE PURE VALUE FUND- DIVIDEND REINVESTMENT",7.5,92.5]
[77,"B301GZ","INF209K01WY1","Aditya Birla Sun Life Income Fund - Growth-Direct Plan",7.5,92.5]
[78,"B303GZ","INF209K01XA9","ADITYA BIRLA SUN LIFE MEDIUM TERM PLAN - GROWTH-DIRECT",7.5,92.5]
[79,"B313DZ","INF209K01R47","Aditya Birla Sun Life Regular Savings Fund - Monthly Dividend-Direct Plan",7.5,92.5]
[80,"B313GZ","INF209K01XH4","Aditya Birla Sun Life Regular Savings Fund - Growth-Direct Plan",7.5,92.5]
[81,"B313PZ","INF209K01XJ0","Aditya Birla Sun Life Regular Savings Fund - Monthly Payment-Direct Plan",7.5,92.5]
[82,"B321GZ","INF209K01N82","Aditya Birla Sun Life Dynamic Bond Fund Growth-Direct",7.5,92.5]
[83,"B32Z","INF209K01S38","Aditya Birla Sun Life Corporate Bond Fund - Growth-Direct Plan",7.5,92.5]
[84,"B341GZ","INF209K01XK8","Aditya Birla Sun Life Short Term Fund - Growth-Direct",7.5,92.5]
[85,"B37AZ","INF209KA1KT0","Aditya Birla Sun Life Corporate Bond Fund -Dividend-Direct Plan",7.5,92.5]
[86,"B37Z","INF209K01N90","Aditya Birla Sun Life Corporate Bond Fund - Monthly Dividend-Direct Plan",7.5,92.5]
[87,"B43G","INF209K01LQ0","Aditya Birla Sun Life Low Duration Fund - Growth-Regular Plan",7.5,92.5]
[88,"B43NZ","INF209K01XU7","Aditya Birla Sun Life Low Duration Fund - Growth-Direct Plan",7.5,92.5]
[89,"B51Z","INF209K01XX1","ADITYA BIRLA SUN LIFE FLEXI CAP FUND - GROWTH-DIRE",7.5,92.5]
[90,"B52DZ","INF209K01XY9","ADITYA BIRLA SUN LIFE FLEXI CAP FUND - DIVIDEND RE",7.5,92.5]
[91,"B85NGZ","INF209K01YN0","Aditya Birla Sun Life Banking & PSU Debt Fund - Growth-Direct Plan",7.5,92.5]
[92,"B85NIG","INF209K01LV0","Aditya Birla Sun Life Banking & PSU Debt Fund - Growth-Regular Plan",7.5,92.5]
[93,"B85NIR","INF209KA11Z3","Aditya Birla Sun Life Banking & PSU Debt Fund - Dividend Reinvestment - Regular Plan",7.5,92.5]
[94,"B91DDZ","INF209K01YW1","Aditya Birla Sun Life Frontline Equity Fund - Dividend Reinvest-Direct",7.5,92.5]
[95,"B91Z","INF209K01YX9","Aditya Birla Sun Life Frontline Equity Fund -Dividend-Direct",7.5,92.5]
[96,"B92Z","INF209K01YY7","Aditya Birla Sun Life Frontline Equity Fund -Growth-Direct",7.5,92.5]
[97,"BADZ","INF209K01ZB2","Aditya Birla Sun Life Equity Hybrid 95 Fund - Dividend Reinvest-Direct Plan",7.5,92.5]
[98,"BAGZ","INF209K01ZC0","Aditya Birla Sun Life Equity Hybrid 95 Fund - Growth-Direct Plan",7.5,92.5]
[99,"BD105","INF084M01DJ5","Aditya Birla Sun Life Balanced Advantage Fund - Growth Direct",7.5,92.5]
[100,"BD106","INF084M01DL1","Aditya Birla Sun Life Balanced Advantage Fund - Direct Dividend",7.5,92.5]
[101,"BD106P","INF084M01DK3","Aditya Birla Sun Life Balanced Advantage Fund Direct Div Payout Option",7.5,92.5]
[102,"BPRG","INF179KA1JC4","HDFC BANKING AND PSU DEBT FUND REGULAR GROWTH OPTION",7.5,92.5]
[103,"BSL201D","INF209K01157","Aditya Birla Sun Life Equity Advantage Fund - Dividend-Regular Plan",7.5,92.5]
[104,"BSL201D","INF209K01CE5","Aditya Birla Sun Life Equity Advantage Fund - Regular Plan Dividend",7.5,92.5]
[105,"BSL201G","INF209K01165","Aditya Birla Sun Life Equity Advantage Fund - Growth-Regular Plan",7.5,92.5]
[106,"BSL205RD","INF209K01256","Aditya Birla Sun Life Arbitrage Fund - Dividend-Regular Plan",7.5,92.5]
[107,"BSL205RD","INF209K01CI6","Aditya Birla Sun Life Arbitrage Fund -Dividend Reinvest-Regular Plan",7.5,92.5]
[108,"BSL205RG","INF209K01264","Aditya Birla Sun Life Arbitrage Fund - Growth-Regular Plan",7.5,92.5]
[109,"BSL221D","INF209K01314","ADITYA BIRLA SUN LIFE MNC FUND - DIVIDEND",7.5,92.5]
[110,"BSL221D","INF209K01CL0","ADITYA BIRLA SUN LIFE MNC FUND - DIVIDEND REINVEST",7.5,92.5]
[111,"BSL221G","INF209K01322","ADITYA BIRLA SUN LIFE MNC FUND - GROWTH",7.5,92.5]
[112,"BSL251D","INF209K01355","ADITYA BIRLA SUN LIFE MIDCAP FUND -PLAN A- DIVIDEND",7.5,92.5]
[113,"BSL251D","INF209K01CN6","ADITYA BIRLA SUN LIFE MIDCAP FUND -PLAN A- DIVIDEND REINVEST",7.5,92.5]
[114,"BSL251G","INF209K01363","ADITYA BIRLA SUN LIFE MIDCAP FUND -PLAN A - GROWTH",7.5,92.5]
[115,"BSL291D","INF209K01439","ADITYA BIRLA SUN LIFE INDIA GENNEXT FUND - DIVIDEND",7.5,92.5]
[116,"BSL291D","INF209K01CR7","ADITYA BIRLA SUN LIFE INDIA GENNEXT FUND - DIVIDEND REINVEST",7.5,92.5]
[117,"BSL291G","INF209K01447","ADITYA BIRLA SUN LIFE INDIA GENNEXT FUND - GROWTH",7.5,92.5]
[118,"BSL292D","INF209K01454","Aditya Birla Sun Life Focused Equity Fund - Dividend-Regular Plan",7.5,92.5]
[119,"BSL292D","INF209K01CS5","Aditya Birla Sun Life Focused Equity Fund - Dividend Reinvest-Regular Plan",7.5,92.5]
[120,"BSL292G","INF209K01462","Aditya Birla Sun Life Focused Equity Fund - Growth-Regular Plan",7.5,92.5]
[121,"BSL301G","INF209K01579","Aditya Birla Sun Life Income Fund - Growth-Regular Plan",7.5,92.5]
[122,"BSL301QD","INF209K01587","Aditya Birla Sun Life Income Fund - Quarterly Dividend-Regular Plan",7.5,92.5]
[123,"BSL301QD","INF209K01CY3","Aditya Birla Sun Life Income Fund - Quarterly Dividend Reinvest-Regular Plan",7.5,92.5]
[124,"BSL303G","INF209K01603","ADITYA BIRLA SUN LIFE MEDIUM TERM PLAN - RETAIL - GROWTH",7.5,92.5]
[125,"BSL303MD","INF209K01611","ADITYA BIRLA SUN LIFE MEDIUM TERM PLAN -RETAIL - MONTHLY DIVIDEND",7.5,92.5]
[126,"BSL303MD","INF209K01DA1","ADITYA BIRLA SUN LIFE MEDIUM TERM PLAN -RETAIL - MONTHLY DIVIDEND REINVEST",7.5,92.5]
[127,"BSL313G","INF209K01751","Aditya Birla Sun Life Regular Savings Fund - Growth-Regular Plan",7.5,92.5]
[128,"BSL313MD","INF209K01769","Aditya Birla Sun Life Regular Savings Fund - Monthly Dividend-Regular Plan",7.5,92.5]
[129,"BSL313MD","INF209K01DF0","Aditya Birla Sun Life Regular Savings Fund - Monthly Dividend Reinvest-Regular Plan",7.5,92.5]
[130,"BSL313MP","INF209K01777","Aditya Birla Sun Life Regular Savings Fund - Monthly Payment-Regular Plan",7.5,92.5]
[131,"BSL32","INF209K01785","Aditya Birla Sun Life Corporate Bond Fund - Growth-Regular Plan",7.5,92.5]
[132,"BSL321G","INF209K01793","ADITYA BIRLA SUN LIFE DYNAMIC BOND FUND - RETAIL - GROWTH",8,92]
[133,"BSL341G","INF209K01942","ADITYA BIRLA SUN LIFE SHORT TERM OPPORTUNITIES FUND-RETAIL GROWTH",7.5,92.5]
[134,"BSL341QD","INF209K01975","ADITYA BIRLA SUN LIFE SHORT TERM OPPORTUNITIES FUND-RETAIL DIVIDEND",7.5,92.5]
[135,"BSL341QD","INF209K01DK0","ADITYA BIRLA SUN LIFE SHORT TERM OPPORTUNITIES FUND-RETAIL DIV REINVEST",7.5,92.5]
[136,"BSL37","INF209K01983","Aditya Birla Sun Life Corporate Bond Fund - Monthly Dividend-Regular Plan",7.5,92.5]
[137,"BSL37","INF209K01DL8","Aditya Birla Sun Life Corporate Bond Fund - Monthly Dividend Reinvest-Regular Plan",7.5,92.5]
[138,"BSL51","INF209K01AJ8","ADITYA BIRLA SUN LIFE FLEXI CAP FUND - GROWTH",7.5,92.5]
[139,"BSL52","INF209K01AQ3","ADITYA BIRLA SUN LIFE FLEXI CAP FUND - DIVIDEND",7.5,92.5]
[140,"BSL52","INF209K01DT1","ADITYA BIRLA SUN LIFE FLEXI CAP FUND - DIVIDEND RE",7.5,92.5]
[141,"BSL91","INF209K01BO6","ADITYA BIRLA SUN LIFE FRONTLINE EQUITY FUND -PLAN A- DIVIDEND",8.5,91.5]
[142,"BSL91","INF209K01EC5","ADITYA BIRLA SUN LIFE FRONTLINE EQUITY FUND -PLAN A- DIVIDEND REINVEST",8.5,91.5]
[143,"BSL92","INF209K01BR9","ADITYA BIRLA SUN LIFE FRONTLINE EQUITY-A",8.5,91.5]
[144,"BSLA","INF209K01BS7","Aditya Birla Sun Life Equity Hybrid 95 Fund - Dividend-Regular Plan",7.5,92.5]
[145,"BSLA","INF209K01EE1","Aditya Birla Sun Life Equity Hybrid 95 Fund - Dividend Reinvest-Regular Plan",7.5,92.5]
[146,"BSLAG","INF209K01BT5","Aditya Birla Sun Life Equity Hybrid 95 Fund - Growth-Regular Plan",7.5,92.5]
[147,"CBFDPGRO","INF789F1A538","UTI Corporate Bond Fund - Direct Growth Plan-Growth",7.5,92.5]
[148,"CBFDPQDP","INF789F1A546","UTI Corporate Bond Fund - Direct Quarterly Dividend Plan-Payout",7.5,92.5]
[149,"CBFDPQDR","INF789F1A553","UTI Corporate Bond Fund - Direct Quarterly Dividend Plan-ReInvestment",7.5,92.5]
[150,"CBFRPGRO","INF789F1A447","UTI CORPORATE BOND FUND - REGULAR GROWTH PLAN-GROWTH",7.5,92.5]
[151,"CPDPD","INF247L01494","MOTILAL OSWAL FLEXI CAP FUND",7.5,92.5]
[152,"CPDPR","INF247L01486","MOTILAL OSWAL FLEXI CAP FUND",7.5,92.5]
[153,"CPGDG","INF247L01502","MOTILAL OSWAL FLEXI CAP FUND",7.5,92.5]
[154,"CPGPG","INF247L01478","MOTILAL OSWAL FLEXI CAP FUND",7.5,92.5]
[155,"CPPDD","INF247L01528","MOTILAL OSWAL FLEXI CAP FUND",7.5,92.5]
[156,"CPPDR","INF247L01510","MOTILAL OSWAL FLEXI CAP FUND",7.5,92.5]
[157,"CRDVDPR","INF760K01035","CANARA ROBECO FLEXI CAP FUND",8.49,91.51]
[158,"CREQDP","INF760K01175","Canara Robeco Emerging Equities",7.5,92.5]
[159,"CREQDPR","INF760K01183","Canara Robeco Emerging Equities",7.5,92.5]
[160,"CREQGP","INF760K01167","Canara Robeco Emerging Equities",7.5,92.5]
[161,"CRFDVD","INF760K01027","CANARA ROBECO FLEXI CAP FUND",8.49,91.51]
[162,"CRFDVG","INF760K01019","CANARA ROBECO FLEXI CAP FUND",7.5,92.5]
[163,"CRGBDP","INF760K01068","Canara Robeco Equity Hybrid Fund",7.5,92.5]
[164,"CRGBDPR","INF760K01076","Canara Robeco Equity Hybrid Fund",7.5,92.5]
[165,"CRGBOE","INF760K01050","Canara Robeco Equity Hybrid Fund",7.5,92.5]
[166,"DEGPGG","INF247L01585","Motilal Oswal Dynamic FundRegular Growth",7.5,92.5]
[167,"DPSTBDDR","INF740K01QK6","DSP Strategic Bond Fund - Direct Plan - Dividend Reinvest",7.5,92.5]
[168,"DSPBLDDR","INF740K01OA2","DSP Equity & Bond Fund - Direct Plan - Dividend Reinvest",7.5,92.5]
[169,"DSPBLDGR","INF740K01NY4","DSP Equity & Bond Fund - Direct Plan - Growth",7.5,92.5]
[170,"DSPBPDDGR","INF740K01ZW2","DSP BANKING & PSU DEBT FUND - Dir - Growth",7.5,92.5]
[171,"DSPBPDRG","INF740K01ZP6","DSP BANKING & PSU DEBT FUND - Reg - Growth",7.5,92.5]
[172,"DSPBRBALF","INF740K01318","DSP Equity & Bond Fund- Regular Plan - Growth",7.5,92.5]
[173,"DSPBRBALF","INF740K01326","DSP Equity & Bond Fund - Regular Plan - Dividend",7.5,92.5]
[174,"DSPBRBALF","INF740K01334","DSP Equity & Bond Fund - Regular Plan - Dividend Reinvest",7.5,92.5]
[175,"DSPBREF","INF740K01011","DSP Flexi Cap Fund - Regular Plan - Dividend",8.5,91.5]
[176,"DSPBREF","INF740K01037","DSP Flexi Cap Fund - Regular Plan - Growth",8.5,91.5]
[177,"DSPBREF","INF740K01029","DSP Flexi Cap Fund - Regular Plan - Dividend Reinvest",8.5,91.5]
[178,"DSPBRF25","INF740K01532","DSP Focus Fund - Regular Plan - Growth",7.5,92.5]
[179,"DSPBRMCF","INF740K01797","DSP Small Cap Fund - Regular Plan - Growth",7.5,92.5]
[180,"DSPBRMCF","INF740K01805","DSP Small Cap Fund - Regular Plan - Dividend",7.5,92.5]
[181,"DSPBRMCF","INF740K01AM6","DSP Small Cap Fund - Regular Plan - Dividend Reinvest",7.5,92.5]
[182,"DSPBRMMF","INF740K01QR1","DSP Ultra Short Fund - Regular Plan - Monthly Dividend Reinvestment",7.5,92.5]
[183,"DSPBROF","INF740K01094","DSP Equity Opportunities Fund - Regular Plan - Growth",7.5,92.5]
[184,"DSPBROF","INF740K01078","DSP Equity Opportunities Fund - Regular Plan - Dividend",7.5,92.5]
[185,"DSPBROF","INF740K01086","DSP Equity Opportunities Fund - Regular Plan - Dividend Reinvest",7.5,92.5]
[186,"DSPBRSMF","INF740K01128","DSP Midcap Fund - Regular Plan - Growth",7.5,92.5]
[187,"DSPBRSMF","INF740K01102","DSP Midcap Fund - Regular Plan - Dividend",7.5,92.5]
[188,"DSPBRSMF","INF740K01110","DSP Midcap Fund - Regular Plan - Dividend Reinvest",7.5,92.5]
[189,"DSPBRSTDF","INF740K01649","DSP Short Term Fund - Regular Plan - Dividend",7.5,92.5]
[190,"DSPBRSTDF","INF740K01AF0","DSP Short Term Fund - Regular Plan - Dividend Reinvest",7.5,92.5]
[191,"DSPBRSTF","INF740K01656","DSP Short Term Fund - Regular Plan - Growth",7.5,92.5]
[192,"DSPBRSTMDF","INF740K01664","DSP Short Term Fund - Regular Plan - Monthly Dividend",7.5,92.5]
[193,"DSPBRSTMDF","INF740K01AG8","DSP Short Term Fund - Regular Plan - Monthly Dividend Reinvest",7.5,92.5]
[194,"DSPBRTEF","INF740K01243","DSP Top 100 Equity Fund - Regular Plan - Growth",8.5,91.5]
[195,"DSPBRTEF","INF740K01227","DSP Top 100 Equity Fund - Regular Plan - Dividend",8.5,91.5]
[196,"DSPBRTEF","INF740K01235","DSP Top 100 Equity Fund - Regular Plan - Dividend Reinvest",8.5,91.5]
[197,"DSPCBDGR","INF740KA1KE8","DSP Corporate Bond Fund - Direct - Growth",7.5,92.5]
[198,"DSPCBDMR","INF740KA1KI9","DSP Corporate Bond Fund - Direct - Monthly Dividend Reinvest",7.5,92.5]
[199,"DSPCBRGR","INF740KA1JX0","DSP CORPORATE BOND FUND-REG-GROWTH",7.5,92.5]
[200,"DSPDAAFRG","INF740K01K57","DSP Dynamic Asset Allocation Fund - Reg - Growth",7.5,92.5]
[201,"DSPDYADGR","INF740K01K81","DSP Dynamic Asset Allocation Fund - Dir - Growth",7.5,92.5]
[202,"DSPEQDDR","INF740K01PK8","DSP Flexi Cap Fund - Direct Plan - Dividend Reinvest",7.5,92.5]
[203,"DSPEQDGR","INF740K01PI2","DSP Flexi Cap Fund - Direct Plan - Growth",7.5,92.5]
[204,"DSPF25DDR","INF740K01OD6","DSP Focus Fund - Direct Plan - Dividend Reinvest",7.5,92.5]
[205,"DSPF25DGR","INF740K01OB0","DSP Focus Fund - Direct Plan - Growth",7.5,92.5]
[206,"DSPMCRDDP","INF740K01QE9","DSP Small Cap Fund - Direct Plan - Dividend",7.5,92.5]
[207,"DSPMCRDDR","INF740K01QF6","DSP Small Cap Fund - Direct Plan - Dividend Reinvest",7.5,92.5]
[208,"DSPMCRDGR","INF740K01QD1","DSP Small Cap Fund - Direct Plan - Growth",7.5,92.5]
[209,"DSPOPPDDP","INF740K01PM4","DSP Equity Opportunities Fund - Direct Plan - Dividend",7.5,92.5]
[210,"DSPOPPDDR","INF740K01PN2","DSP Equity Opportunities Fund - Direct Plan - Dividend Reinvest",7.5,92.5]
[211,"DSPOPPDGR","INF740K01PL6","DSP Equity Opportunities Fund - Direct Plan - Growth",7.5,92.5]
[212,"DSPSMCDDR","INF740K01PZ6","DSP Midcap Fund - Direct Plan - Dividend Reinvest",7.5,92.5]
[213,"DSPSMCDGR","INF740K01PX1","DSP Midcap Fund - Direct Plan - Growth",7.5,92.5]
[214,"DSPSTDGR","INF740K01NJ5","DSP Short Term Fund - Direct Plan - Growth",7.5,92.5]
[215,"DSPSTDMDP","INF740K01NL1","DSP Short Term Fund - Direct Plan - Monthly Dividend",7.5,92.5]
[216,"DSPSTDMDR","INF740K01NM9","DSP Short Term Fund - Direct Plan - Monthly Dividend Reinvest",7.5,92.5]
[217,"DSPTOPDDR","INF740K01PT9","DSP Top 100 Equity Fund - Direct Plan - Dividend Reinvest",7.5,92.5]
[218,"DSPTOPDGR","INF740K01PR3","DSP Top 100 Equity Fund - Direct Plan - Growth",7.5,92.5]
[219,"DSPUSTDGR","INF740K013Q1","DSP MUTUAL FUND Low Duration Fund DIR GROWTH OP",7.5,92.5]
[220,"DSPUSTRGR","INF740K018P2","DSP MUTUAL FUND Low Duration Fund REG GROWTH OP",7.5,92.5]
[221,"EARE","INF754K01285","Edelweiss Balance Advantage Fund - Growth Option",7.5,92.5]
[222,"EARE","INF754K01251","Edelweiss Balance Advantage Fund - Quarterly Div Payout Option",7.5,92.5]
[223,"EARE","INF754K01269","Edelweiss Balance Advantage Fund -Quarterly Div Reivestment Option",7.5,92.5]
[224,"EMDDP","INF903J01PQ1","SUNDARAM LARGE AND MID CAP FUND DIRECT DIVIDEND",7.5,92.5]
[225,"EMFARBMDDP","INF754K01HW1","EDELWEISS ARBITRAGE FUND-DIRECT PLAN-MONTHLY DIVIDEND PAYOUT",7.5,92.5]
[226,"EMFARBMDDR","INF754K01HX9","EDELWEISS ARBITRAGE FUND-DIRECT PLAN-MONTHLY DIVIDEND REINVESTMENT",7.5,92.5]
[227,"EMFARBMDRP","INF754K01HT7","EDELWEISS ARBITRAGE FUND-REGULAR PLAN-MONTHLY DIVIDEND PAYOUT",7.5,92.5]
[228,"EMFARBMDRR","INF754K01HU5","EDELWEISS ARBITRAGE FUND-REGULAR PLAN-MONTHLY DIVIDEND REINVESTMENT",7.5,92.5]
[229,"EMFDARMDDR","INF754K01II8","Edelweiss Balance Advantage Fund-Direct Plan Monthly Div Reinvest",7.5,92.5]
[230,"EMFDARMDRP","INF754K01IK4","Edelweiss Balance Advantage Fund-Regular Plan Monthly Div Payout",7.5,92.5]
[231,"EMFDARMDRR","INF754K01IL2","Edelweiss Balance Advantage Fund-Regular Plan Monthly Div Reinvest",7.5,92.5]
[232,"EMGPD","INF903J01PR9","SUNDARAM LARGE AND MID CAP FUND DIRECT GROWTH",7.5,92.5]
[233,"FCPED","INF917K01LA2","L&T Hybrid Equity Fund - Dividend",7.5,92.5]
[234,"FCPEG","INF917K01LB0","L&T Hybrid Equity Fund - Growth",7.5,92.5]
[235,"FCPEP","INF917K01KZ1","L&T Hybrid Equity Fund - Dividend Payout",7.5,92.5]
[236,"FEF-D","INF677K01056","L T FLEXICAP FUND",8.5,91.5]
[237,"FEF-G","INF677K01031","L T FLEXICAP FUND",8.5,91.5]
[238,"FEF-P","INF677K01049","L T FLEXICAP FUND",8.5,91.5]
[239,"FFUSOFDDR","INF090I01JQ2","FRANKLIN INDIA FEEDER FRANKLIN U.S. OPPORTUNITIES DIRECT DIVIDEND REINVEST",7.5,92.5]
[240,"FFUSOFDGR","INF090I01JR0","FRANKLIN INDIA FEEDER - FRANKLIN U.S. OPPORTUNITIES FUND - DIRECT - GROWTH",7.5,92.5]
[241,"FFUSOFDP","INF090I01EV3","FRANKLIN INDIA FEEDER - FRANKLIN U.S. OPPORTUNITIES FUND - DIVIDEND PAYOUT",7.5,92.5]
[242,"FFUSOFDR","INF090I01EU5","FRANKLIN INDIA FEEDER - FRANKLIN U.S. OPPORTUNITIES DIVIDEND REINVEST",7.5,92.5]
[243,"FFUSOFGR","INF090I01EW1","FRANKLIN INDIA FEEDER - FRANKLIN U.S. OPPORTUNITIES FUND - GROWTH",7.5,92.5]
[244,"FIBCFDDP","INF090I01FO5","FRANKLIN INDIA BLUECHIP FUND - DIRECT DIVIDEND",7.5,92.5]
[245,"FIBCFDDR","INF090I01FP2","FRANKLIN INDIA BLUECHIP FUND - DIRECT DIVIDEND",7.5,92.5]
[246,"FIBCFDGP","INF090I01FN7","FRANKLIN INDIA BLUECHIP FUND - DIRECT GROWTH",7.5,92.5]
[247,"FIBCFDP","INF090I01155","FRANKLIN INDIA BLUECHIP FUND",8.5,91.5]
[248,"FIBCFDR","INF090I01163","FRANKLIN INDIA BLUECHIP FUND",8.5,91.5]
[249,"FIBCFGP","INF090I01171","FRANKLIN INDIA BLUECHIP FUND",8.5,91.5]
[250,"FIBPDFDGP","INF090I01KR8","Franklin India Banking and PSU Debt Fund-Direct",7.5,92.5]
[251,"FIBPDFDP","INF090I01KT4","Franklin India Banking and PSU Debt Fund-Direct",7.5,92.5]
[252,"FIBPDFDR","INF090I01KQ0","FRANKLIN INDIA BANKING AND PSU DEBT FUND DIVIDEND REINVESTMENT",7.5,92.5]
[253,"FIBPDFGP","INF090I01KO5","FRANKLIN INDIA BANKING AND PSU DEBT FUND GROWTH",7.5,92.5]
[254,"FIFCAPDGP","INF090I01IN1","Franklin India Equity Advantage Fund-Direct",7.5,92.5]
[255,"FIFCAPGP","INF090I01205","Franklin India Equity Advantage Fund",8.5,91.5]
[256,"FIHGCFDDP","INF090I01IU6","Franklin India Focused Equity Fund-Direct",7.5,92.5]
[257,"FIHGCFDDR","INF090I01IV4","Franklin India Focused Equity Fund-Direct",7.5,92.5]
[258,"FIHGCFDGP","INF090I01IW2","Franklin India Focused Equity Fund-Direct",7.5,92.5]
[259,"FIHGCFDP","INF090I01965","Franklin India Focused Equity Fund",7.5,92.5]
[260,"FIHGCFDR","INF090I01973","Franklin India Focused Equity Fund",7.5,92.5]
[261,"FIHGCFGP","INF090I01981","Franklin India Focused Equity Fund",7.5,92.5]
[262,"FIPFDDP","INF090I01FI7","FRANKLIN INDIA PRIMA FUND - DIRECT DIVIDEND",7.5,92.5]
[263,"FIPFDDR","INF090I01FJ5","FRANKLIN INDIA PRIMA FUND - DIRECT DIVIDEND",7.5,92.5]
[264,"FIPFDGP","INF090I01FH9","FRANKLIN INDIA PRIMA FUND - DIRECT GROWTH",7.5,92.5]
[265,"FIPFDP","INF090I01726","FRANKLIN INDIA PRIMA FUND",7.5,92.5]
[266,"FIPFDR","INF090I01734","FRANKLIN INDIA PRIMA FUND",7.5,92.5]
[267,"FIPFGP","INF090I01809","FRANKLIN INDIA PRIMA FUND",7.5,92.5]
[268,"FIPPDDP","INF090I01FL1","Franklin India Equity Fund-Direct",7.5,92.5]
[269,"FIPPDDR","INF090I01FM9","Franklin India Equity Fund-Direct",7.5,92.5]
[270,"FIPPDGP","INF090I01FK3","Franklin India Equity Fund-Direct",7.5,92.5]
[271,"FIPPDP","INF090I01213","Franklin India Equity Fund",7.5,92.5]
[272,"FIPPDR","INF090I01221","Franklin India Equity Fund",7.5,92.5]
[273,"FIPPGP","INF090I01239","Franklin India Equity Fund",7.5,92.5]
[274,"FISCFDDP","INF090I01IO9","FRANKLIN INDIA SMALLER COMPANIES FUND - DIRECT DIVIDEND",7.5,92.5]
[275,"FISCFDDR","INF090I01IP6","FRANKLIN INDIA SMALLER COMPANIES FUND - DIRECT DIVIDEND",7.5,92.5]
[276,"FISCFDGP","INF090I01IQ4","FRANKLIN INDIA SMALLER COMPANIES FUND - DIRECT GROWTH",7.5,92.5]
[277,"FISCFDP","INF090I01544","FRANKLIN INDIA SMALLER COMPANIES FUND",7.5,92.5]
[278,"FISCFDR","INF090I01551","FRANKLIN INDIA SMALLER COMPANIES FUND",7.5,92.5]
[279,"FISCFGP","INF090I01569","FRANKLIN INDIA SMALLER COMPANIES FUND",7.5,92.5]
[280,"FISSD","INF677K01114","L&T Large and MidCap Fund - Dividend",7.5,92.5]
[281,"FISSG","INF677K01098","L&T Large and MidCap Fund - Growth",7.5,92.5]
[282,"FISSP","INF677K01106","L&T Large and MidCap Fund - Dividend Payout",7.5,92.5]
[283,"FIVFD","INF677K01015","L & T INDIA VALUE FUND",7.5,92.5]
[284,"FIVFG","INF677K01023","L & T INDIA VALUE FUND",7.5,92.5]
[285,"FIVFP","INF677K01213","L & T INDIA VALUE FUND",7.5,92.5]
[286,"FRFRPADR","INF789F1ACS5","UTI Floater Fund-Annual Dividend Plan-ReInvestment",7.5,92.5]
[287,"FRFRPFDR","INF789F1ACW7","UTI Floater Fund-Flexi Dividend Plan-ReInvestment",7.5,92.5]
[288,"FRFRPGRO","INF789F1ACO4","UTI Floater Fund-Growth Plan",7.5,92.5]
[289,"FRFRPQDR","INF789F1ACQ9","UTI Floater Fund-Quarterly Dividend Plan-ReInvestment",7.5,92.5]
[290,"FSMDR","INF789FA1O93","UTI Ultra Short Term Monthly Div Reinvest",7.5,92.5]
[291,"FTIBFDDR","INF090I01GB0","Franklin India Equity Hybrid Fund- Diect",7.5,92.5]
[292,"FTIBFDGP","INF090I01FZ1","Franklin India Equity Hybrid Fund-Direct",7.5,92.5]
[293,"FTIBFDP","INF090I01825","Franklin India Equity Hybrid Fund",7.5,92.5]
[294,"FTIBFDR","INF090I01833","Franklin India Equity Hybrid Fund",7.5,92.5]
[295,"FTIBFGP","INF090I01817","Franklin India Equity Hybrid Fund",7.5,92.5]
[296,"H01RTDR","INF179K01VM3","HDFC EQUITY FUND - DIRECT PLAN - DIVIDEND REINVESTMENT OPTION",7.5,92.5]
[297,"H01TDP","INF179K01VL5","HDFC EQUITY FUND - DIRECT PLAN - DIVIDEND PAYOUT OPTION",7.5,92.5]
[298,"H02TGR","INF179K01UT0","HDFC EQUITY FUND-DIRECT PLAN-GROWTH OPTION",7.5,92.5]
[299,"H30TGR","INF179K01WI9","HDFC Medium Term Debt Fund - Growth Option",7.5,92.5]
[300,"H41RTDR","INF179K01YU0","HDFC Top 100 Fund - Direct Plan - Dividend Reinvestment Option",7.5,92.5]
[301,"H41TDP","INF179K01YT2","HDFC Top 100 Fund - Direct Plan - Dividend",7.5,92.5]
[302,"H44TGR","INF179K01YV8","HDFC Top 100 Fund-Direct Plan-Growth Option",7.5,92.5]
[303,"H54TGR","INF179K01VF7","HDFC Low Duration Fund - Direct Plan - Retail Plan - Growth Option",7.5,92.5]
[304,"H60RTDR","INF179K01VH3","HDFC Low Duration Fund - Direct Plan - Retail Plan - Monthly Dividend",7.5,92.5]
[305,"H60TDP","INF179K01VG5","HDFC Low Duration Fund - Direct Plan - Retail Plan - Monthly Dividend",7.5,92.5]
[306,"H61RTDR","INF179K01VB6","HDFC Capital Builder Value Fund - Direct Plan - Dividend Reinvestment Option",7.5,92.5]
[307,"H61TDP","INF179K01VA8","HDFC Capital Builder Value Fund - Direct Plan - Dividend",7.5,92.5]
[308,"H62TGR","INF179K01VC4","HDFC Capital Builder Value Fund - Direct Plan - Growth Option",7.5,92.5]
[309,"HBPGT","INF179KA1IZ7","HDFC BANKING AND PSU DEBT FUND DIRECT PLAN GROWTH OPTION",7.5,92.5]
[310,"HDFC01","INF179K01582","HDFC EQUITY FUND - DIVIDEND PAYOUT OPTION",8.5,91.5]
[311,"HDFC01D","INF179K01590","HDFC EQUITY FUND DIVIDEND REINVESTMENT",8.5,91.5]
[312,"HDFC02","INF179K01608","HDFC EQUITY FUND - GROWTH OPTION",8.5,91.5]
[313,"HDFC29","INF179K01897","HDFC Medium Term Debt Fund - Fortnightly Dividend",7.5,92.5]
[314,"HDFC29D","INF179K01905","HDFC Medium Term Debt Fund - Fortnightly Dividend Reinvestment",7.5,92.5]
[315,"HDFC30","INF179K01913","HDFC Medium Term Debt Fund - Regular Plan - Growth",7.5,92.5]
[316,"HDFC41","INF179K01BC6","HDFC Top 100 Fund - Regular Plan - Dividend",8.5,91.5]
[317,"HDFC41D","INF179K01BD4","HDFC Top 100 Fund - Regular Plan - Dividend Reinvest",8.5,91.5]
[318,"HDFC44","INF179K01BE2","HDFC Top 100 Fund - Regular Plan - Growth",8.5,91.5]
[319,"HDFC54","INF179K01442","HDFC Low Duration Fund - Retail - Regular Plan - Growth",7.5,92.5]
[320,"HDFC58","INF179K01475","HDFC Low Duration Fund - Retail - Regular Plan - Weekly Dividend",7.5,92.5]
[321,"HDFC58D","INF179K01483","HDFC Low Duration Fund - Retail - Regular Plan - Weekly Dividend Reinvestment",7.5,92.5]
[322,"HDFC59","INF179K01434","HDFC Low Duration Fund - Retail - Regular Plan - Daily Dividend",7.5,92.5]
[323,"HDFC60","INF179K01459","HDFC Low Duration Fund - Retail - Regular Plan - Monthly Dividend",7.5,92.5]
[324,"HDFC60D","INF179K01467","HDFC Low Duration Fund - Retail - Regular Plan - Monthly Dividend Reinvestment",7.5,92.5]
[325,"HDFC61","INF179K01400","HDFC Capital Builder Value Fund - Regular Plan - Dividend",7.5,92.5]
[326,"HDFC61D","INF179K01418","HDFC Capital Builder Value Fund - Regular Plan - Dividend Reinvestment",7.5,92.5]
[327,"HDFC62","INF179K01426","HDFC Capital Builder Value Fund - Regular Plan - Growth",7.5,92.5]
[328,"HDFCAFWDM","INF179KA1KO7","HDFC ARBITRAGE FUND-WHOLESALE - REGULAR-MONTHLY DIV PAYOUT",7.5,92.5]
[329,"HDFCAFWDM","INF179KA1KN9","HDFC ARBITRAGE FUND-WHOLESALE - REGULAR-MONTHLY DIV REINVESTMENT",7.5,92.5]
[330,"HDFCAFWDQ","INF179KA1KM1","HDFC ARBITRAGE FUND-WHOLESALE - REGULAR-NORMAL DIV PAYOUT",7.5,92.5]
[331,"HDFCAFWDQ","INF179KA1KL3","HDFC ARBITRAGE FUND-WHOLESALE - REGULAR-NORMAL DIV REINVESTMENT",7.5,92.5]
[332,"HDFCAFWDT","INF179KA1KQ2","HDFC ARBITRAGE FUND-WHOLESALE-DIRECT-NORMAL DIV PAYOUT",7.5,92.5]
[333,"HDFCAFWDT","INF179KA1KP4","HDFC ARBITRAGE FUND-WHOLESALE-DIRECT-NORMAL DIV REINVESTMENT",7.5,92.5]
[334,"HDFCAFWGT","INF179KA1KT6","HDFC ARBITRAGE FUND-WHOLESALE-DIRECT-GROWTH",7.5,92.5]
[335,"HDFCAFWMT","INF179KA1KS8","HDFC ARBITRAGE FUND-WHOLESALE-DIRECT-MONTHLY DIV PAYOUT",7.5,92.5]
[336,"HDFCAFWMT","INF179KA1KR0","HDFC ARBITRAGE FUND-WHOLESALE-DIRECT-MONTHLY DIV REINVESTMENT",7.5,92.5]
[337,"HDFCGFD","INF179K01814","HDFC Balance Advantage Fund - Regular Plan - Dividend",7.5,92.5]
[338,"HDFCGFDD","INF179K01822","HDFC Balance Advantage Fund - Regular Plan - Dividend Reinvest",7.5,92.5]
[339,"HDFCGFG","INF179K01830","HDFC Balance Advantage Fund - Regular Plan - Growth",7.5,92.5]
[340,"HDFCILR","INF179K01723","HDFC Floating Rate Debt Fund - Wholesale Option - Regular Plan -Dividend Monthly Reinvestment",7.5,92.5]
[341,"HDFCISWDM","INF179K01715","HDFC Floating Rate Debt Fund - Wholesale Option - Regular Plan - Dividend Monthly",7.5,92.5]
[342,"HDFCISWG","INF179K01707","HDFC Floating Rate Debt Fund - Wholesale Option - Regular Plan - Growth",7.5,92.5]
[343,"HDFCMILMD","INF179K01AB0","HDFC Hybrid Debt Fund - Regular Plan - Monthly Dividend Reinvestment",8.5,91.5]
[344,"HDFCMILQD","INF179K01AD6","HDFC Hybrid Debt Fund - Regular Plan - Quarterly Dividend Reinvestment",8.5,91.5]
[345,"HDFCMILTG","INF179K01AE4","HDFC Hybrid Debt Fund - Regular Plan - Growth",8.5,91.5]
[346,"HDFCMILTM","INF179K01AA2","HDFC Hybrid Debt Fund - Regular Plan - Monthly Dividend",8.5,91.5]
[347,"HDFCMILTQ","INF179K01AC8","HDFC Hybrid Debt Fund - Regular Plan - Quarterly Dividend",8.5,91.5]
[348,"HDFCMTODR","INF179K01DE8","HDFC Corporate Bond Fund - Regular Plan - Quarterly Dividend Reinvestment",7.5,92.5]
[349,"HDFCMULG","INF179K01AM7","HDFC EQUITY SAVING FUND - GROWTH OPTION",7.5,92.5]
[350,"HDFCPREG","INF179K01AS4","HDFC Hybrid Equity Fund - Regular Plan - Growth",7.5,92.5]
[351,"HGFDRTDR","INF179K01VZ5","HDFC Balance Advantage Fund - Direct Plan - Dividend Reinvestment Option",7.5,92.5]
[352,"HGFDTDP","INF179K01VY8","HDFC Balance Advantage Fund - Direct Plan - Dividend",7.5,92.5]
[353,"HGFGTGR","INF179K01WA6","HDFC Balance Advantage Fund - Direct Plan - Growth Option",7.5,92.5]
[354,"HINNP","INF179K01KZ8","HDFC Index Fund-Nifty 50 Plan - Regular Plan (Post Addendum)",7.5,92.5]
[355,"HINNPT","INF179K01WM1","HDFC Index Fund-Nifty 50 Plan - Regular Plan (Post Addendum)",7.5,92.5]
[356,"HINSP","INF179K01LA9","HDFC Index Fund - Sensex Plan - Regular Plan (Post Addendum)",7.5,92.5]
[357,"HINSPT","INF179K01WN9","HDFC Index Fund - Sensex Plan - Direct Plan (Post Addendum)",7.5,92.5]
[358,"HISDMTDP","INF179K01VO9","HDFC Floating Rate Debt Fund - Direct Plan - Wholesale Option - Monthly Dividend",7.5,92.5]
[359,"HISMRTDR","INF179K01VP6","HDFC Floating Rate Debt Fund- Direct Plan - Wholesale - Monthly Dividend Reinvest",7.5,92.5]
[360,"HISWGTGR","INF179K01VQ4","HDFC Floating Rate Debt Fund - Direct Plan - Wholesale Option - Growth Option",7.5,92.5]
[361,"HLCFRDP","INF179KA1RU9","HDFC Growth Opportunities Fund - Regular Plan - Dividend",7.5,92.5]
[362,"HLCFRG","INF179KA1RT1","HDFC Growth Opportunities Fund - Regular Plan - Growth",7.5,92.5]
[363,"HMCODTDP","INF179K01XO5","HDFC MID-CAP OPPORTUNITIES FUND - DIRECT PLAN - DIVIDEND PAYOUT OPTION",7.5,92.5]
[364,"HMCOGTGR","INF179K01XQ0","HDFC MID-CAP OPPORTUNITIES FUND - DIRECT PLAN - GROWTH OPTION",7.5,92.5]
[365,"HMCORTDR","INF179K01XP2","HDFC MID-CAP OPPORTUNITIES FUND - DIRECT PLAN - DIVIDEND REINVESTMENT",7.5,92.5]
[366,"HMIDCAP-DP","INF179K01CS0","HDFC MID-CAP OPPORTUNITIES FUND - DIVIDEND PAYOUT OPTION",7.5,92.5]
[367,"HMIDCAP-DR","INF179K01CT8","HDFC MID-CAP OPP. FUND",7.5,92.5]
[368,"HMIDCAP-G","INF179K01CR2","HDFC MID-CAP OPPORTUNITIES FUND - GROWTH OPTION",8.5,91.5]
[369,"HMLMRTDR","INF179K01XG1","HDFC Hybrid Debt Fund - Direct Plan - Monthly Dividend Reinvestment Option",7.5,92.5]
[370,"HMLQRTDR","INF179K01XI7","HDFC Hybrid Debt Fund - Direct Plan - Quarterly Dividend Reinvestment Option",7.5,92.5]
[371,"HMLTGTGR","INF179K01XE6","HDFC Hybrid Debt Fund - Direct Plan - Growth Option",7.5,92.5]
[372,"HMLTMTDP","INF179K01XF3","HDFC Hybrid Debt Fund Plan - Direct Plan - Monthly Dividend",7.5,92.5]
[373,"HMLTQTDP","INF179K01XH9","HDFC Hybrid Debt Fund - Direct Plan - Quarterly Dividend",7.5,92.5]
[374,"HMTOD","INF179K01DD0","HDFC Corporate Bond Fund - Regular Plan - Quarterly Dividend",7.5,92.5]
[375,"HMTODTDP","INF179K01XB2","HDFC Corporate Bond Fund - Direct Plan - Qtrly Dividend",7.5,92.5]
[376,"HMTOG","INF179K01DC2","HDFC Corporate Bond Fund - Regular Plan - Growth",9.5,90.5]
[377,"HMTOGTGR","INF179K01XD8","HDFC Corporate Bond Fund - Direct Plan - Growth Option",7.5,92.5]
[378,"HMTORTDR","INF179K01XC0","HDFC Corporate Bond Fund - Direct - Quarterly Dividend Reinvestment",7.5,92.5]
[379,"HMULGTGR","INF179K01XT4","HDFC EQUITY SAVING FUND - DIRECT PLAN - GROWTH OPTION",7.5,92.5]
[380,"HPREGTGR","INF179K01XZ1","HDFC Hybrid Equity Fund-Direct Plan-Growth Option",7.5,92.5]
[381,"HSMCFDDP","INF179KA1RX3","HDFC SMALL CAP FUND - DIRECT PLAN - DIV",7.5,92.5]
[382,"HSMCFDDR","INF179KA1RY1","HDFC SMALL CAP FUND - DIRECT PLAN - DIV REINVESTMENT",7.5,92.5]
[383,"HSMCFDG","INF179KA1RW5","HDFC SMALL CAP FUND - DIRECT PLAN - GROWTH",7.5,92.5]
[384,"HSMCFRDP","INF179KA1SA9","HDFC SMALL CAP FUND - REGULAR PLAN - DIV",7.5,92.5]
[385,"HSMCFRDR","INF179KA1SB7","HDFC SMALL CAP FUND - REGULAR PLAN - DIV REINVESTMENT",7.5,92.5]
[386,"HSMCFRG","INF179KA1RZ8","HDFC SMALL CAP FUND - REGULAR PLAN - GROWTH",7.5,92.5]
[387,"HSTOD","INF179K01CV4","HDFC Short Term Debt Fund - Regular Plan - Fortnightly Dividend",7.5,92.5]
[388,"HSTOG","INF179K01CU6","HDFC Short Term Debt Fund - Regular Plan - Growth",7.5,92.5]
[389,"HSTOGTGR","INF179K01YM7","HDFC Short Term Debt Fund - Direct Plan - Growth Option",7.5,92.5]
[390,"HSTOPRNDP","INF179KA1Q79","HDFC Short Term Debt Fund - Regular Plan - Normal Dividend",7.5,92.5]
[391,"HUSTFRD","INF179KB11R3","HDFC Ultra Short Term Regular Growth",7.5,92.5]
[392,"HUSTFRMDD","INF179KB16R2","HDFC Ultra Short Term Regular Monthly Dividend Payout",7.5,92.5]
[393,"HUSTFRMDR","INF179KB15R4","HDFC Ultra Short Term Regular Monthly Dividend Reinvest",7.5,92.5]
[394,"ID305DP","INF194KA1R28","IDFC CORPORATE BOND FUND-REGULAR PLAN -MONTHLY DIVIDEND PAYOUT",7.5,92.5]
[395,"ID305RDR","INF194KA1R36","IDFC CORPORATE BOND FUND-REGULAR PLAN -MONTHLY DIVIDEND REINVESTMENT",7.5,92.5]
[396,"ID306RDR","INF194KA1R69","IDFC CORPORATE BOND FUND-REGULAR PLAN -QUARTERLY DIVIDEND REINVESTMENT",7.5,92.5]
[397,"IDD202DR","INF194K01W05","IDFC Core Equity Fund-Dividend Reinvestment-(Direct Plan)",7.5,92.5]
[398,"IDD204DR","INF194K01W88","IDFC MultiCap Fund-Div-(Direct Plan)",7.5,92.5]
[399,"IDD206DR","INF194K01W47","IDFC FOCUS EQUITY FUND-DIV-(DIRECT PLAN)",7.5,92.5]
[400,"IDD210DR","INF194K01Y86","IDFC ARBITRAGE FUND DIRECT MONTHLY DIVIDEND REINVESTMENT",7.5,92.5]
[401,"IDD216DR","INF194K010A2","IDFC Sterling Value Fund-Dividend Reinvestment-(Direct Plan)",7.5,92.5]
[402,"IDD281DR","INF194K017G4","IDFC Banking And PSU Debt Fund-Direct Plan-Dividend",7.5,92.5]
[403,"IDD283DR","INF194K011N3","IDFC Banking And PSU Debt Fund-Direct Plan-Monthly-Dividend",7.5,92.5]
[404,"IDD303GR","INF194KA1M23","IDFC CORPORATE BOND FUND-DIRECT PLAN - GROWTH",7.5,92.5]
[405,"IDD68DP","INF194K01K17","IDFC Low Duration Fund-Monthly Dividend-(Direct Plan)-Dividend Payout",7.5,92.5]
[406,"IDD68DR","INF194K01K09","IDFC Low Duration Fund-Monthly Dividend Reinvestment-(Direct Plan)",7.5,92.5]
[407,"IDDDQBDR","INF194K01N71","IDFC DYNAMIC BOND FUND-QUARTERLY DIV-(DIRECT PLAN)",7.5,92.5]
[408,"IDDSTDDR","INF194K01U15","IDFC BondFund-Short Term Plan-Monthly Div-(Direct Plan)",7.5,92.5]
[409,"IDDSTFDR","INF194K01U49","IDFC SUPER SAVER INCOME FUND-SHORT TERM PLAN-FORTNIGHTLY DIV-(DIRECT PLAN)",7.5,92.5]
[410,"IDFC201","INF194K01524","IDFC Core Equity Fund-Regular Plan-Growth",7.5,92.5]
[411,"IDFC203","INF194K01391","IDFC MultiCap Fund-Regular Plan-Growth",8.5,91.5]
[412,"IDFC204","INF194K01409","IDFC MultiCap Fund-Regular Plan-Dividend Payout",7.5,92.5]
[413,"IDFC204R","INF194K01417","IDFC MultiCap Fund-Dividend-(Regular Plan)",7.5,92.5]
[414,"IDFC205","INF194K01466","IDFC FOCUS EQUITY FUND-REGULAR PLAN-GROWTH",7.5,92.5]
[415,"IDFC209","INF194K01649","IDFC ARBITRAGE FUND-REGULAR PLAN- GROWTH",7.5,92.5]
[416,"IDFC210","INF194K01656","IDFC ARBITRAGE FUND REGULAR MONTHLY DIVIDEND PAYOUT",7.5,92.5]
[417,"IDFC210R","INF194K01664","IDFC ARBITRAGE FUND REGULAR MONTHLY DIVIDEND REINVESTMENT",7.5,92.5]
[418,"IDFC215","INF194K01342","IDFC Sterling Value Fund-Regular Plan-Growth",7.5,92.5]
[419,"IDFC216","INF194K01359","IDFC Sterling Value Fund-Regular Plan-Dividend Reinvestment",7.5,92.5]
[420,"IDFC216R","INF194K01367","IDFC Sterling Value Fund - Regular - Dividend Reinvestment",7.5,92.5]
[421,"IDFC259","INF194K01JZ9","IDFC SSIF-MEDIUM TERM PLAN -QUARTERLY DIVIDEND-(REGULAR PLAN)",7.5,92.5]
[422,"IDFC259R","INF194K01JY2","IDFC SSIF-MEDIUM TERM PLAN -QUARTERLY DIVIDEND-(REGULAR PLAN)",7.5,92.5]
[423,"IDFC280","INF194K01SN6","IDFC Banking And PSU Debt Fund-Regular Plan-Growth",7.5,92.5]
[424,"IDFC281","INF194K01SO4","IDFC Banking And PSU Debt Fund-Regular Plan-Dividend",7.5,92.5]
[425,"IDFC281R","INF194K012D2","IDFC Banking And PSU Debt Fund-Regular Plan-Dividend",7.5,92.5]
[426,"IDFC283R","INF194K017M2","IDFC Banking And PSU Debt Fund-Regular Plan-Monthly-Dividend",7.5,92.5]
[427,"IDFC284","INF194K014M9","IDFC Banking And PSU Debt Fund-Regular Plan-Quarterly-Dividend",7.5,92.5]
[428,"IDFC301","INF194KA1YD2","IDFC ARBITRAGE FUND-REGULAR PLAN -ANNUAL DIVIDEND PAYOUT",7.5,92.5]
[429,"IDFC301R","INF194KA1YE0","IDFC ARBITRAGE FUND-REGULAR PLAN -ANNUAL DIVIDEND REINVESTMENT",7.5,92.5]
[430,"IDFC303","INF194KA1L81","IDFC CORPORATE BOND FUND REGULAR PLAN-GRO",7.5,92.5]
[431,"IDFC304R","INF194KA1M07","IDFC CORPORATE BOND FUND REGULAR PLAN-DIV-REINVESTMENT",7.5,92.5]
[432,"IDFC327","INF194KA10Q8","IDFC Ultra Short Term Fund-Growth",7.5,92.5]
[433,"IDFC328R","INF194KA19Q9","IDFC Ultra Short Term Fund-Quarterly-DivReinvest",7.5,92.5]
[434,"IDFC65","INF194K01FU8","IDFC Low Duration Fund-Regular Plan-Growth",7.5,92.5]
[435,"IDFC82","INF194K01QG4","IDFC DYNAMIC BOND FUND-REGULAR PLAN-GROWTH",7.5,92.5]
[436,"IDFC83R","INF194K01QN0","IDFC DYNAMIC BOND FUND-DIVIDEND-(REGULAR PLAN)",7.5,92.5]
[437,"IDFCD201","INF194K01V89","IDFC Core Equity Fund-Growth-(Direct Plan)",7.5,92.5]
[438,"IDFCD202","INF194K01V97","IDFC Core Equity Fund-Dividend-(Direct Plan)-Dividend Payout",7.5,92.5]
[439,"IDFCD203","INF194K01W62","IDFC MultiCap Fund-Growth-(Direct Plan)",7.5,92.5]
[440,"IDFCD205","INF194K01W21","IDFC FOCUS EQUITY FUND-GROWTH-(DIRECT PLAN)",7.5,92.5]
[441,"IDFCD209","INF194K01Y60","IDFC ARBITRAGE FUND-GROWTH-(DIRECT PLAN)",7.5,92.5]
[442,"IDFCD210","INF194K01Y78","IDFC ARBITRAGE FUND DIRECT MONTHLY DIVIDEND PAYOUT",7.5,92.5]
[443,"IDFCD215","INF194K01Z85","IDFC Sterling Value Fund-Growth-(Direct Plan)",7.5,92.5]
[444,"IDFCD280","INF194K015G8","IDFC Banking And PSU Debt Fund-Direct Plan-Growth",7.5,92.5]
[445,"IDFCD290","INF194KA1SR4","IDFC BondFund Short Term Periodic Div (Direct )",7.5,92.5]
[446,"IDFCD290R","INF194KA1SS2","IDFC BondShort Term Direct Periodic Reinvest",7.5,92.5]
[447,"IDFCD301R","INF194KA1YH3","IDFC ARBITRAGE FUND-DIRECT PLAN -ANNUAL DIVIDEND REINVESTMENT",7.5,92.5]
[448,"IDFCD65","INF194K01J77","IDFC Low Duration Fund-Growth-(Direct Plan)",7.5,92.5]
[449,"IDFCD82","INF194K01N63","IDFC DYNAMIC BOND FUND-GROWTH-(DIRECT PLAN)",7.5,92.5]
[450,"IDFCDMTG","INF194K01S50","IDFC Bond Fund-Medium Term Growth Direct",7.5,92.5]
[451,"IDFCDSSG","INF194K01R51","IDFC Bond Fund - Long Term Plan Growth Direct",7.5,92.5]
[452,"IDFCDSTG","INF194K01U07","IDFC BondFund-Short Term Growth Direct",7.5,92.5]
[453,"IDFCMTG","INF194K01JU0","IDFC Bond Fund - Medium Term Plan-Regular Plan-Growth",7.5,92.5]
[454,"IDFCSSD","INF194K01IT4","IDFC SSIF-IP-QUARTERLY DIVIDEND-(REGULAR PLAN)",7.5,92.5]
[455,"IDFCSSDR","INF194K01IS6","IDFC SSIF-IP-QUARTERLY DIVIDEND-(REGULAR PLAN)",7.5,92.5]
[456,"IDFCSSG","INF194K01IL1","IDFC Super Saver Income Fund - Investment Plan-Regular Plan-Growth",7.5,92.5]
[457,"IDFCSSHR","INF194K01IP2","IDFC SSIF-IP-HALF YEARLY DIVIDEND-(REGULAR PLAN)",7.5,92.5]
[458,"IDFCSTF","INF194K01HK5","IDFC Bond Fund Short Term Regular Fortnightly Div Payout",7.5,92.5]
[459,"IDFCSTF","INF194K01HJ7","IDFC Bond Fund Short Term Regular Fortnightly Div Reinv",7.5,92.5]
[460,"IDFCSTG","INF194K01HF5","IDFC Bond Fund - Short Term -Regular Plan-Growth",7.5,92.5]
[461,"IMFCFD2DP","INF205K01LC8","Invesco India Contra Fund - Direct Plan Dividend Payout",7.5,92.5]
[462,"IMFCFD2DR","INF205K01LD6","Invesco India Contra Fund - Direct Plan Dividend Reinvestment",7.5,92.5]
[463,"IMFGFD1GR","INF205K01MA0","Invesco India Growth Opportunities Fund - Dir P Gr",7.5,92.5]
[464,"IMFGFD2DP","INF205K01LY2","Invesco India Growth Opportunities Fund - Dir P Div Pay",7.5,92.5]
[465,"IMFGFD2DR","INF205K01LZ9","Invesco India Growth Opportunities Fund - Dir P Div Reinv",7.5,92.5]
[466,"IMFUSIWDR","INF205K01IA8","Invesco India Treasury Advantage Fund - WeeklyDR",7.5,92.5]
[467,"IP122P","INF109K01FK7","ICICI PRUDENTIAL MULTICAP FUND DIVIDEND PAYOUT",7.5,92.5]
[468,"IP1477","INF109K01CQ1","ICICI Prudential Corporate Bond Fund - Growth",7.5,92.5]
[469,"IP1479","INF109K01SM6","ICICI Prudential Corporate Bond Fund - Weekly Dividend",7.5,92.5]
[470,"IP1481","INF109K01CT5","ICICI Prudential Corporate Bond Fund - Monthly Dividend",7.5,92.5]
[471,"IP1481P","INF109K01SK0","ICICI Prudential Corporate Bond Fund - Monthly Dividend Payout",7.5,92.5]
[472,"IP1482","INF109K01SO2","ICICI Prudential Corporate Bond Fund - Quarterly Dividend",7.5,92.5]
[473,"IP1482P","INF109K01SN4","ICICI Prudential Corporate Bond Fund - Quarterly Dividend Payout",7.5,92.5]
[474,"IP1524","INF109K01738","ICICI Prudential Savings Fund - Daily Dividend",7.5,92.5]
[475,"IP1525","INF109K01746","ICICI Prudential Savings Fund - Growth",7.5,92.5]
[476,"IP1526","INF109K01753","ICICI Prudential Savings Fund - Weekly Dividend",7.5,92.5]
[477,"IP1543","INF109K01AX1","ICICI Prudential Floating Interest Fund - Growth",7.5,92.5]
[478,"IP1587","INF109K01RT3","ICICI PRUDENTIAL BANKING AND PSU DEBT FUND GROWTH",7.5,92.5]
[479,"IP1713P","INF109K01GK5","ICICI Prudential All Seasons Bond Fund - Dividend Payout",7.5,92.5]
[480,"IP1729","INF109K01UF6","ICICI Prudential Medium Term Bond Fund - Quarterly Dividend Payout",7.5,92.5]
[481,"IP1733","INF109K01IX4","ICICI Prudential Regular Savings Fund - Quarterly Dividend Payout",7.5,92.5]
[482,"IP1839","INF109K01YD3","ICICI PRUDENTIAL BANKING AND PSU DEBT FUND QUARTERLY DIVIDEND",7.5,92.5]
[483,"IP1839P","INF109K01YE1","ICICI PRUDENTIAL BANKING AND PSU DEBT FUND QUARTERLY DIVIDEND PAYOUT",7.5,92.5]
[484,"IP23F","INF109K01662","ICICI Prudential Short Term Fund - Fortnightly Dividend",7.5,92.5]
[485,"IP25PP","INF109K01GL3","ICICI Prudential All Seasons Bond Fund - Dividend",7.5,92.5]
[486,"IP25PPA","INF109K01GP4","ICICI Prudential All Seasons Bond Fund - Annual Dividend",7.5,92.5]
[487,"IP25PPQ","INF109K01GF5","ICICI Prudential All Seasons Bond Fund - Quarterly Dividend",7.5,92.5]
[488,"IP26PP","INF109K01GN9","ICICI Prudential All Seasons Bond Fund - Growth",7.5,92.5]
[489,"IPAMP","INF109K01837","ICICI Prudential Asset Allocator Fund - Growth",7.5,92.5]
[490,"IPBFIN1233","INF109K01BU5","ICICI PRUDENTIAL BANKING AND FINANCIAL SERVICES FUND - GROWTH",7.5,92.5]
[491,"IPBFIN1234","INF109K01BV3","ICICI PRUDENTIAL BANKING AND FINANCIAL SERVICES FUND - DIVIDEND",7.5,92.5]
[492,"IPDISCODFD","INF109K01AD3","ICICI PRUDENTIAL VALUE DISCOVERY FUND DIVIDEND",7.5,92.5]
[493,"IPDISCODFG","INF109K01AF8","ICICI PRUDENTIAL VALUE DISCOVERY GROWTH",7.5,92.5]
[494,"IPDYNMIC15","INF109K01761","ICICI Prudential Multi-Asset Fund - Growth",8.5,91.5]
[495,"IPDYNMIC16","INF109K01779","ICICI Prudential Multi-Asset Fund - Dividend",7.5,92.5]
[496,"IPEQDEDWRD","INF109K01BG4","ICICI PRU - BALANCED ADVANTAGE FUND",7.5,92.5]
[497,"IPEQDEDWRG","INF109K01BH2","ICICI PRU -BALANCED ADVANTAGE FUND",7.5,92.5]
[498,"IPESTARESD","INF109K01AL6","ICICI PRUDENTIAL MIDCAP FUND DIVIDEND",7.5,92.5]
[499,"IPESTARESG","INF109K01AN2","ICICI PRUDENTIAL MIDCAP FUND GROWTH",7.5,92.5]
[500,"IPFOCU1191","INF109K01BL4","ICICI Prudential Bluechip Fund - Growth",8.5,91.5]
[501,"IPFOCU1192","INF109K01BM2","ICICI Prudential Bluechip Fund - Dividend",7.5,92.5]
[502,"IPGROWTH11","INF109K01431","ICICI Prudential Large & Mid Cap Fund - Growth",7.5,92.5]
[503,"IPGROWTH12","INF109K01449","ICICI Prudential Large & Mid Cap Fund - Dividend",7.5,92.5]
[504,"IPIMPD","INF109K01894","ICICI Prudential Regular Savings Fund - Monthly Dividend",7.5,92.5]
[505,"IPIMPG","INF109K01902","ICICI Prudential Regular Savings Fund - Growth",7.5,92.5]
[506,"IPLFRAH","INF109K01B61","ICICI Prudential Medium Term Bond Fund - Half Yearly Dividend",7.5,92.5]
[507,"IPPOWER121","INF109K01613","ICICI PRUDENTIAL MULTICAP FUND - GROWTH",7.5,92.5]
[508,"IPPOWER122","INF109K01621","ICICI PRUDENTIAL MULTICAP FUND - DIVIDEND PLAN REINVESTMENT",7.5,92.5]
[509,"IPRU1192P","INF109K01EP9","ICICI Prudential Bluechip Fund - Dividend Payout",8.5,91.5]
[510,"IPRU1234P","INF109K01DY3","ICICI PRUDENTIAL BANKING AND FINANCIAL SERVICES FUND - DIVIDEND PAYOUT",7.5,92.5]
[511,"IPRU1262","INF109K01BO8","ICICI Prudential Bond Fund - Growth",7.5,92.5]
[512,"IPRU1263","INF109K01BP5","ICICI Prudential Bond Fund - Monthly Dividend",7.5,92.5]
[513,"IPRU1280","INF109K01BS9","ICICI Prudential Bond Fund - Quarterly Dividend",7.5,92.5]
[514,"IPRU12P","INF109K01EQ7","ICICI Prudential Large & Mid Cap Fund - Dividend Payout",7.5,92.5]
[515,"IPRU16P","INF109K01ED5","ICICI Prudential Multi-Asset Fund - Dividend Payout",7.5,92.5]
[516,"IPRU1710P","INF109K01JO1","ICICI Prudential Savings Fund - Weekly Dividend Payout",7.5,92.5]
[517,"IPRU1746","INF109K01TP7","ICICI Prudential Ultra Short Term Fund - Growth",7.5,92.5]
[518,"IPRU1747","INF109K01TQ5","ICICI Prudential Ultra Short Term Fund - Monthly Dividend",7.5,92.5]
[519,"IPRU1747P","INF109K01TR3","ICICI Prudential Ultra Short Term Fund - Monthly Dividend Payout",7.5,92.5]
[520,"IPRU1748","INF109K01TS1","ICICI Prudential Ultra Short Term Fund - Quarterly Dividend",7.5,92.5]
[521,"IPRU2059","INF109K017W5","ICICI PRUDENTIAL BALANCED ADVANTAGE FUND - MONTHLY DIVIDEND",7.5,92.5]
[522,"IPRU2059P","INF109K018W3","ICICI PRUDENTIAL BALANCED ADVANTAGE FUND - MONTHLY DIVIDEND PAYOUT",7.5,92.5]
[523,"IPRU2072","INF109K015Z2","ICICI Prudential Savings Fund - Quarterly Dividend",7.5,92.5]
[524,"IPRU2073","INF109KA1020","ICICI Prudential Floating Interest Fund - Monthly Dividend",7.5,92.5]
[525,"IPRU2074","INF109KA1046","ICICI Prudential Floating Interest Fund - Quarterly Dividend",7.5,92.5]
[526,"IPRU24","INF109K01654","ICICI Prudential Short Term Fund - Growth Option",7.5,92.5]
[527,"IPRU2494","INF109KA1M62","ICICI PRUDENTIAL BANKING AND PSU DEBT FUND - HALF YEARLY DIVIDEND",7.5,92.5]
[528,"IPRU2519","INF109KA1Y27","ICICI PRUDENTIAL BALANCED ADVANTAGE FUND - QUARTERLY DIVIDEND",7.5,92.5]
[529,"IPRU2519P","INF109KA1Y35","ICICI PRUDENTIAL BALANCED ADVANTAGE FUND - QUARTERLY DIVIDEND PAYOUT",7.5,92.5]
[530,"IPRU2526P","INF109KA1X02","ICICI Prudential Short Term Fund - Half Yearly Dividend",7.5,92.5]
[531,"IPRU2527","INF109KA1X44","ICICI Prudential Bond Fund - Half Yearly Dividend",7.5,92.5]
[532,"IPRU2551","INF109KA13G1","ICICI Prudential Medium Term Bond Fund - Annual Dividend",7.5,92.5]
[533,"IPRU2556","INF109KA14I5","ICICI Prudential Equity Savings Fund Cumulative",7.5,92.5]
[534,"IPRU2559","INF109KA10J1","ICICI Prudential Equity Savings Fund Half Yearly Dividend",7.5,92.5]
[535,"IPRU2559P","INF109KA17I8","ICICI Prudential Equity Savings Fund Half Yearly Dividend Payout",7.5,92.5]
[536,"IPRU61","INF109K01480","ICICI PRUDENTIAL EQUITY & DEBT FUND - GROWTH",7.5,92.5]
[537,"IPRU62","INF109K01498","ICICI PRUDENTIAL EQUITY & DEBT FUND - MONTHLY DIVIDEND",7.5,92.5]
[538,"IPRU62P","INF109K01DX5","ICICI PRUDENTIAL EQUITY & DEBT FUND - MONTHLY DIVIDEND PAYOUT",7.5,92.5]
[539,"IPRU8002","INF109K011O5","ICICI Prudential Large & Mid Cap Fund - Direct Plan - Growth",7.5,92.5]
[540,"IPRU8003","INF109K010O7","ICICI Prudential Large & Mid Cap Fund - Direct Plan - Dividend",7.5,92.5]
[541,"IPRU8003P","INF109K019N0","ICICI Prudential Large & Mid Cap Fund - Direct Plan - Dividend Payout",7.5,92.5]
[542,"IPRU8004","INF109K015K4","ICICI Prudential Multi-Asset Fund - Direct Plan - Growth",7.5,92.5]
[543,"IPRU8005","INF109K014K7","ICICI Prudential Multi-Asset Fund - Direct Plan - Dividend",7.5,92.5]
[544,"IPRU8005P","INF109K013K9","ICICI Prudential Multi-Asset Fund - Direct Plan - Dividend Payout",7.5,92.5]
[545,"IPRU8008","INF109K015N8","ICICI Prudential Short Term Fund - Direct Plan - Monthly Dividend",7.5,92.5]
[546,"IPRU8009","INF109K013N3","ICICI Prudential Short Term Fund-Direct Plan-Growth Option",7.5,92.5]
[547,"IPRU8017","INF109K01Y07","ICICI PRUDENTIAL EQUITY & DEBT FUND-DIRECT PLAN- GROWTH",7.5,92.5]
[548,"IPRU8018","INF109K01X99","ICICI PRUDENTIAL BALANCED DIRECT MONTHLY DIVIDEND",7.5,92.5]
[549,"IPRU8018P","INF109K01X81","ICICI PRUDENTIAL BALANCED DIRECT MONTHLY DIVIDEND PAYOUT",7.5,92.5]
[550,"IPRU8030","INF109K014O9","ICICI PRUDENTIAL MULTICAP FUND - DIRECT PLAN - GROWTH",7.5,92.5]
[551,"IPRU8031","INF109K013O1","ICICI PRUDENTIAL MULTICAP FUND - DIRECT PLAN - DIVIDEND",7.5,92.5]
[552,"IPRU8031P","INF109K012O3","ICICI PRUDENTIAL MULTICAP FUND - DIRECT PLAN - DIVIDEND PAYOUT",7.5,92.5]
[553,"IPRU8042","INF109K016L0","ICICI Prudential Bluechip Fund - Direct Plan - Growth",7.5,92.5]
[554,"IPRU8043","INF109K015L2","ICICI Prudential Bluechip Fund - Direct Plan - Dividend",7.5,92.5]
[555,"IPRU8043P","INF109K014L5","ICICI Prudential Bluechip Fund - Direct Plan - Dividend Payout",7.5,92.5]
[556,"IPRU8044","INF109K013J1","ICICI PRU BANKING AND FINANCIAL SERVICES FUND - DIRECT PLAN - GROWTH",7.5,92.5]
[557,"IPRU8045","INF109K012J3","ICICI PRU BANKING AND FINANCIAL SERVICES FUND - DIRECT PLAN - DIVIDEND",7.5,92.5]
[558,"IPRU8048","INF109K01V83","ICICI Prudential Bond Fund - Direct Plan - Growth",7.5,92.5]
[559,"IPRU8049","INF109K01V67","ICICI Prudential Bond Fund - Direct Plan - Monthly Dividend",7.5,92.5]
[560,"IPRU8078","INF109K016B1","ICICI Prudential Corporate Bond Fund - Direct Plan - Growth",7.5,92.5]
[561,"IPRU8080","INF109K011C0","ICICI Prudential Corporate Bond Fund - Direct Plan - Weekly Dividend",7.5,92.5]
[562,"IPRU8082","INF109K018B7","ICICI Prudential Corporate Bond Fund - Direct Plan - Monthly Dividend",7.5,92.5]
[563,"IPRU8082P","INF109K017B9","ICICI Prudential Corporate Bond Fund - Direct Plan - Monthly Dividend Payout",7.5,92.5]
[564,"IPRU8083","INF109K012C8","ICICI Prudential Corporate Bond Fund - Direct Plan - Quarterly Dividend",7.5,92.5]
[565,"IPRU8083P","INF109K019B5","ICICI Prudential Corporate Bond Fund - Direct Plan - Quarterly Dividend Payout",7.5,92.5]
[566,"IPRU8085","INF109K01O66","ICICI Prudential Savings Fund - Direct Plan - Daily Dividend",7.5,92.5]
[567,"IPRU8086","INF109K01O82","ICICI Prudential Savings Fund - Direct Plan - Growth",7.5,92.5]
[568,"IPRU8087","INF109K01P16","ICICI Prudential Savings Fund - Direct Plan - Weekly Dividend",7.5,92.5]
[569,"IPRU8087P","INF109K01P08","ICICI Prudential Savings Fund - Direct Plan - Weekly Dividend Payout",7.5,92.5]
[570,"IPRU8089","INF109K01P57","ICICI Prudential Floating Interest Fund - Direct Plan - Growth",7.5,92.5]
[571,"IPRU8104","INF109K010A6","ICICI PRUDENTIAL BANKING AND PSU DEBT FUND - DIRECT PLAN - GROWTH",7.5,92.5]
[572,"IPRU8105","INF109K01Z97","ICICI PRUDENTIAL BANKING AND PSU DEBT FUND - DIRECT PLAN - DAILY DIVIDEND",7.5,92.5]
[573,"IPRU8123","INF109K01T04","ICICI Prudential Ultra Short Term Fund - Direct Plan - Growth",7.5,92.5]
[574,"IPRU8124","INF109K01T46","ICICI Prudential Ultra Short Term Fund - Direct Plan - Monthly Dividend",7.5,92.5]
[575,"IPRU8124P","INF109K01T38","ICICI Prudential Ultra Short Term Fund - Direct Plan - Monthly Dividend Payout",7.5,92.5]
[576,"IPRU8132","INF109K012A2","ICICI PRU BANKING AND PSU DEBT FUND - DIRECT PLAN - QUARTERLY DIVIDEND",7.5,92.5]
[577,"IPRU8141","INF109K012N5","ICICI Prudential Short Term Fund - Direct Plan - Fortnightly Dividend",7.5,92.5]
[578,"IPRU8142","INF109K015E7","ICICI Prudential All Seasons Bond Fund - Direct Plan - Dividend",7.5,92.5]
[579,"IPRU8144","INF109K018E1","ICICI Prudential All Seasons Bond Fund - Direct Plan - Quarterly Dividend",7.5,92.5]
[580,"IPRU8145","INF109K016E5","ICICI Prudential All Seasons Bond Fund-Direct Plan-Growth",7.5,92.5]
[581,"IPRU8157","INF109K01X16","ICICI Prudential Asset Allocator Fund - Direct Plan - Growth",7.5,92.5]
[582,"IPRU8175","INF109K010K5","ICICI PRUDENTIAL VALUE DISCOVERY FUND DIRECT DIVIDEND",7.5,92.5]
[583,"IPRU8175P","INF109K011K3","ICICI PRUDENTIAL VALUE DISCOVERY FUND DIRECT DIVIDEND PAYOUT",7.5,92.5]
[584,"IPRU8176","INF109K012K1","ICICI PRUDENTIAL VALUE DISCOVERY FUND DIRECT GROWTH",7.5,92.5]
[585,"IPRU8177","INF109K015O6","ICICI PRUDENTIAL EQUITY ARBITRAGE FUND - DIRECT PLAN - DIVIDEND",7.5,92.5]
[586,"IPRU8177P","INF109K017O2","ICICI PRUDENTIAL EQUITY ARBITRAGE FUND - DIRECT PLAN - DIVIDEND PAYOUT",7.5,92.5]
[587,"IPRU8178","INF109K016O4","ICICI PRUDENTIAL EQUITY ARBITRAGE FUND - DIRECT PLAN - GROWTH",7.5,92.5]
[588,"IPRU8179","INF109K011B2","ICICI PRUDENTIAL BALANCED ADVANTAGE FUND - DIRECT PLAN - DIVIDEND",7.5,92.5]
[589,"IPRU8179P","INF109K010B4","ICICI PRU BALANCED ADVANTAGE FUND - DIRECT PLAN - DIVIDEND PAYOUT",7.5,92.5]
[590,"IPRU8180","INF109K012B0","ICICI PRUDENTIAL BALANCED ADVANTAGE FUND - DIRECT PLAN - GROWTH",7.5,92.5]
[591,"IPRU8181","INF109K010N9","ICICI PRUDENTIAL MIDCAP FUND - DIRECT PLAN - DIVIDEND",7.5,92.5]
[592,"IPRU8182","INF109K011N7","ICICI PRUDENTIAL MIDCAP FUND - DIRECT PLAN - GROWTH",7.5,92.5]
[593,"IPRU8185","INF109K01S70","ICICI Prudential Regular Savings Fund - Direct Plan - Monthly Dividend",7.5,92.5]
[594,"IPRU8186","INF109K01S54","ICICI Prudential Regular Savings Fund - Direct Plan - Half Yearly Dividend",7.5,92.5]
[595,"IPRU8187","INF109K01S96","ICICI Prudential Regular Savings Fund - Direct Plan - Quarterly Dividend",7.5,92.5]
[596,"IPRU8188","INF109K01S39","ICICI Prudential Regular Savings Fund - Direct Plan - Growth",7.5,92.5]
[597,"IPRU8190","INF109K015A5","ICICI Prudential Medium Term Bond Fund - Direct Plan - Growth",7.5,92.5]
[598,"IPRU8191","INF109K017A1","ICICI Prudential Medium Term Bond Fund - Direct Plan - Half Yearly Dividend",7.5,92.5]
[599,"IPRU8192","INF109K019A7","ICICI Prudential Medium Term Bond Fund - Direct Plan - Quarterly Dividend",7.5,92.5]
[600,"IPRU8192P","INF109K018A9","ICICI Prudential Medium Term Bond Fund - Direct Plan - Quarterly Dividend Payout",7.5,92.5]
[601,"IPRU8272","INF109K019Y7","ICICI Prudential Savings Fund - Direct Plan - Quarterly Dividend",7.5,92.5]
[602,"IPRU8695","INF109KA1N20","ICICI Prudential Corporate Bond Fund - Direct Plan - Half Yearly Dividend",7.5,92.5]
[603,"IPRU8726","INF109KA1X28","ICICI Prudential Short Term Fund - Direct Plan - Half Yearly Dividend",7.5,92.5]
[604,"IPRU8758","INF109KA11J9","ICICI Prudential Equity Savings Fund Direct Plan Cumulative",7.5,92.5]
[605,"IPRU8759","INF109KA15J0","ICICI Prudential Equity Savings Fund Direct Plan Monthly Dividend",7.5,92.5]
[606,"IPRU8760","INF109KA16J8","ICICI Prudential Equity Savings Fund Direct Plan Quarterly Dividend",7.5,92.5]
[607,"IPRU8761","INF109KA17J6","ICICI Prudential Equity Savings Fund Direct Plan Half Yearly Dividend",7.5,92.5]
[608,"IPRUDFDP","INF109K01EC7","ICICI PRUDENTIAL VALUE DISCOVERY FUND - DIVIDEND PAYOUT",7.5,92.5]
[609,"IPRUEDIRD","INF109K01BE9","ICICI PRUDENTIAL EQUITY ARBITRAGE FUND - DIVIDEND",7.5,92.5]
[610,"IPRUEDIRG","INF109K01BF6","ICICI PRUDENTIAL EQUITY ARBITRAGE FUND - GROWTH",7.5,92.5]
[611,"IPRUEDIRP","INF109K01EF0","ICICI PRUDENTIAL EQUITY ARBITRAGE FUND - DIVIDEND PAYOUT",7.5,92.5]
[612,"IPRUEDWRP","INF109K01EG8","ICICI PRUDENTIAL BALANCED ADVANTAGE FUND - DIVIDEND PAYOUT",7.5,92.5]
[613,"IPRUESDP","INF109K01EH6","ICICI PRUDENTIAL MIDCAP FUND - DIVIDEND PAYOUT",7.5,92.5]
[614,"IPRUIMPDH","INF109K01WX5","ICICI Prudential Regular Savings Fund - Half Yearly Dividend",7.5,92.5]
[615,"IPRUIMPDP","INF109K01ER5","ICICI Prudential Regular Savings Fund - Monthly Dividend Payout",7.5,92.5]
[616,"IPRUIMPDQ","INF109K01WY3","ICICI Prudential Regular Savings Fund - Quarterly Dividend",7.5,92.5]
[617,"IPRULFRAG","INF109K01AH4","ICICI Prudential Medium Term Bond Fund - Growth",7.5,92.5]
[618,"IPRULFRAQ","INF109K01IO3","ICICI Prudential Medium Term Bond Fund - Quarterly Dividend",7.5,92.5]
[619,"IPRULTP25W","INF109K01704","ICICI Prudential All Seasons Bond Fund - Weekly Dividend",7.5,92.5]
[620,"K30","INF174K01179","Kotak Bluechip Fund - Regular Plan",7.5,92.5]
[621,"K30","INF174K01153","Kotak Bluechip Fund - Regular Plan",7.5,92.5]
[622,"K30","INF174K01161","Kotak Bluechip Fund - Regular Plan",7.5,92.5]
[623,"K30G13D","INF174K01KW6","Kotak 50 Equity Scheme - Direct Plan - GrowthGrowth",7.5,92.5]
[624,"K30R03D","INF174K01KY2","Kotak 50 Equity Scheme -Direct Plan -Dividend ReinvestmentDividend",7.5,92.5]
[625,"KAFBDP","INF174K01F18","KOTAK EQUITY ARBITRAGE FUND-BIMONTHLY DIVIDEND PAYOUT",7.5,92.5]
[626,"KBALANCE","INF174K01450","KOTAK EQUITY HYBRID FUND",7.5,92.5]
[627,"KBALANCE","INF174K01443","KOTAK EQUITY HYBRID FUND",7.5,92.5]
[628,"KBALG04GD","INF174K01F00","Kotak Balance -Direct Plan Growth",7.5,92.5]
[629,"KBG","INF174K01E92","KOTAK EQUITY HYBRID FUND",7.5,92.5]
[630,"KBONG06D","INF174K01JC0","Kotak Bond Scheme -Direct Plan Growth",7.5,92.5]
[631,"KBONREGG","INF174K01EM0","KOTAK BOND FUND",7.5,92.5]
[632,"KBONREGQDP","INF174K01EO6","KOTAK BOND FUND",7.5,92.5]
[633,"KBONREGQDR","INF174K01EN8","KOTAK BOND FUND",7.5,92.5]
[634,"KBST20HDD","INF174K01YS5","KOTAK BOND SHORT TERM FUND",7.5,92.5]
[635,"KBST20HDPD","INF174K01YR7","KOTAK BOND SHORT TERM FUND",7.5,92.5]
[636,"KBST20NDD","INF174K01Z22","KOTAK BOND SHORT TERM FUND",7.5,92.5]
[637,"KBSTG","INF174K01ES7","KOTAK BOND SHORT TERM FUND",7.5,92.5]
[638,"KBSTG10D","INF174K01JI7","KOTAK BOND SHORT TERM FUND",7.5,92.5]
[639,"KCPLB188D","INF174K01F42","Kotak Equity Arbitrage Fund -Direct Plan Bimonthly Dividend",7.5,92.5]
[640,"KCPLG179D","INF174K01LC6","Kotak Equity Arbitrage Fund -Direct Plan Growth",7.5,92.5]
[641,"KCPLM189D","INF174K01LE2","Kotak Equity Arbitrage Fund -Direct Plan Monthly Dividend",7.5,92.5]
[642,"KEAFBDP","INF174K01F26","KOTAK EQUITY ARBITRAGE FUND-NON DIRECT PLAN-BIMONTHLY DIVIDEND PAYOUT",7.5,92.5]
[643,"KEME133D","INF174K01LV6","KOTAK EMERGING EQUITY FUND",7.5,92.5]
[644,"KEMEDP","INF174K01DU5","KOTAK EMERGING EQUITY FUND",7.5,92.5]
[645,"KEMEDR","INF174K01DT7","KOTAK EMERGING EQUITY FUND",7.5,92.5]
[646,"KEMEG","INF174K01DS9","KOTAK EMERGING EQUITY FUND",7.5,92.5]
[647,"KEMEG123D","INF174K01LT0","KOTAK EMERGING EQUITY FUND",7.5,92.5]
[648,"KEQARBIT","INF174K01328","KOTAK EQUITY ARBITRAGE FUND",7.5,92.5]
[649,"KEQARBIT","INF174K01302","KOTAK EQUITY ARBITRAGE FUND",7.5,92.5]
[650,"KEQARBIT","INF174K01310","KOTAK EQUITY ARBITRAGE FUND",7.5,92.5]
[651,"KESFRG","INF174K01C78","KOTAK EQUITY SAVINGS FUND REGULAR GROWTH",7.5,92.5]
[652,"KFLTG","INF174K01FD6","Kotak Savings Fund - Regular Plan",7.5,92.5]
[653,"KFLTG135D","INF174K01JP2","Kotak Savings Fund - Direct Plan Growth",7.5,92.5]
[654,"KFLTMDR","INF174K01FH7","Kotak Savings Fund - Regular Plan",7.5,92.5]
[655,"KFLXG197D","INF174K01JU2","Kotak Flexi Debt Scheme -Direct Plan Growth",7.5,92.5]
[656,"KGSG","INF174K01FO3","KOTAK BANKING AND PSU FUND - GROWTH",7.5,92.5]
[657,"KGSMDP","INF174K01FQ8","KOTAK BANKING AND PSU FUND - MONTHLY DIVIDEND PAYOUT",7.5,92.5]
[658,"KGSMDR","INF174K01FP0","KOTAK BANKING AND PSU FUND - MONTHLY DIVIDEND REINVESTMENT",7.5,92.5]
[659,"KKCBG258G","INF178L01BY0","Kotak Corporate Bond Fund -Direct Plan Growth",7.5,92.5]
[660,"KKGSG01D","INF174K01KH7","Kotak Banking & PSU Debt Fund Direct GrowthGrowth",7.5,92.5]
[661,"KKOPG108D","INF174K01LF9","Kotak Opportunities -Direct Plan Growth",7.5,92.5]
[662,"KKSFG35D","INF174K01D28","Kotak Equity Savings Scheme -Direct Plan Growth",7.5,92.5]
[663,"KMDFG48D","INF174K01VQ5","Kotak Medium Term Fund -Direct Plan Growth",7.5,92.5]
[664,"KMDFQ49D","INF174K01VT9","Kotak Medium Term Fund -Direct Plan Quarterly Dividend",7.5,92.5]
[665,"KMEDIUM","INF174K01VL6","KOTAK MEDIUM TERM PLAN REGULAR GROWTH",7.5,92.5]
[666,"KMEDIUMQD","INF174K01VM4","KOTAK MEDIUM TERM PLAN QUARTERLY DIVIDEND",7.5,92.5]
[667,"KMEDIUMQD","INF174K01VO0","KOTAK MEDIUM TERM -REGULAR -QUARTERLY DIVI REINVEST",7.5,92.5]
[668,"KMIDCAP","INF174K01237","Kotak Small Cap Fund - Regular Plan",7.5,92.5]
[669,"KMIDCAP","INF174K01211","Kotak Small Cap Fund - Regular Plan",7.5,92.5]
[670,"KMIDCAP","INF174K01229","Kotak Small Cap Fund - Regular Plan",7.5,92.5]
[671,"KMIDG104D","INF174K01KT2","Kotak Mid-Cap -Direct Plan Growth",7.5,92.5]
[672,"KOPPORT","INF174K01203","Kotak Equity Opportunities Fund - Regular Plan",7.5,92.5]
[673,"KOPPORT","INF174K01187","Kotak Equity Opportunities Fund - Regular Plan",7.5,92.5]
[674,"KOPPORT","INF174K01195","Kotak Equity Opportunities Fund - Regular Plan",7.5,92.5]
[675,"KSEF178D","INF174K01LR4","Kotak Select Focus Fund-Direct Plan Dividend",7.5,92.5]
[676,"KSEFR168D","INF174K01LS2","KOTAK FLEXICAP FUND-DIRECT PLAN GROWTH",7.5,92.5]
[677,"KSFOCUS","INF174K01351","Kotak Standard Multicap Fund- Regular Plan",7.5,92.5]
[678,"KSFOCUS","INF174K01336","Kotak Standard Multicap Fund- Regular Plan",7.5,92.5]
[679,"KSFOCUS","INF174K01344","Kotak Standard Multicap Fund- Regular Plan",7.5,92.5]
[680,"KTKFLEXI","INF174K01FA2","Kotak Dynamic Bond Fund - Regular Plan",7.5,92.5]
[681,"KTKFLEXI","INF174K01IZ3","Kotak Dynamic Bond Fund - Regular Plan",7.5,92.5]
[682,"LD086G","INF200K01TF5","SBI MAGNUM ULTRA SHORT DURATION FUND DIRECT GROWTH",7.5,92.5]
[683,"LD114G","INF200K01QU0","SBI ARBITRAGE OPPORTUNITIES FUND - DIRECT PLAN - GROWTH",7.5,92.5]
[684,"LEBFG","INF917K01QC7","L&T EMERGING BUSINESSES FUND GROWTH",7.5,92.5]
[685,"LEBFP","INF917K01QB9","L&T EMERGING BUSINESSES FUND DIVIDED PAYOUT",7.5,92.5]
[686,"04PD","INF903J01MJ3","SUNDARAM MID CAP FUND DIRECT GROWTH",7.5,92.5]
[687,"05PD","INF903J01MH7","SUNDARAM MID CAP FUND DIRECT DIVIDEND",7.5,92.5]
[688,"05PD","INF903J01MI5","SUNDARAM MID CAP FUND DIRECT DIVIDEND",7.5,92.5]
[689,"122D","INF917K01HS2","L&T ULTRA SHORT TERM FUND DIRECT PLAN - GROWTH",7.5,92.5]
[690,"131AD","INF917K01VS3","L&T Short Term Bond Fund - Annual Dividend",7.5,92.5]
[691,"153DP","INF903J01PA5","SUNDARAM BANKING & PSU DEBT FUND DIRECT PLAN-GR",7.5,92.5]
[692,"157DP","INF903J01NR4","SUNDARAM CORPORATE BOND FUND DIRECT GROWTH",7.5,92.5]
[693,"41PD","INF903J01MN5","SUNDARAM EQUITY HYBRID FUND DIRECT DIVIDEND",7.5,92.5]
[694,"41PD","INF903J01MO3","SUNDARAM EQUITY HYBRID FUND DIRECT DIVIDEND",7.5,92.5]
[695,"91PD","INF903J01NF9","SUNDARAM RURAL AND CONSUMPTION FUND DIRECT DIVIDEND",7.5,92.5]
[696,"91PD","INF903J01NG7","SUNDARAM RURAL AND CONSUMPTION FUND DIRECT DIVIDEND",7.5,92.5]
[697,"92PD","INF903J01NH5","SUNDARAM RURAL AND CONSUMPTION FUND DIRECT GROWTH",7.5,92.5]
[698,"LFSG","INF677K01AE7","L&T LOW DURATION FUND - GROWTH",7.5,92.5]
[699,"LNT01","INF917K01AG2","L&T TRIPLE ACE-REGULAR-QUARTERLY DIVIDEND",7.5,92.5]
[700,"LNT01D","INF917K01HO1","L&T Triple Ace Bond Direct Quarterly Dividend",7.5,92.5]
[701,"LNT01DP","INF917K01HP8","L&T Triple Ace Bond Direct Quarterly Dividend Payout",7.5,92.5]
[702,"LNT01P","INF917K01AF4","L&T TRIPLE ACE-REGULAR-QUARTERLY DIVIDEND PAYOUT",7.5,92.5]
[703,"LNT02","INF917K01AH0","L&T TRIPLE ACE-REGULAR-CUMULATIVE",7.5,92.5]
[704,"LNT02D","INF917K01HN3","L&T Triple Ace Bond Direct Growth",7.5,92.5]
[705,"LNT09","INF917K01AJ6","L&T Triple Ace Bond Fund - Semi Annual Dividend",7.5,92.5]
[706,"LNT122","INF917K01AS7","L&T ULTRA SHORT TERM FUND - GR",7.5,92.5]
[707,"LNT131D","INF917K01IO9","L&T Short Term Bond Direct Dividend",7.5,92.5]
[708,"LNT133D","INF917K01IQ4","L&T Short Term Bond Direct Growth",7.5,92.5]
[709,"LNT16","INF917K01247","L&T MIDCAP FUND DIVIDEND",7.5,92.5]
[710,"LNT16D","INF917K01FX6","L&T Midcap Direct Dividend",7.5,92.5]
[711,"LNT16P","INF917K01239","L&T MIDCAP FUND DIVIDEND PAYOUT",7.5,92.5]
[712,"LNT17","INF917K01254","L&T MIDCAP FUND CUMULATIVE",7.5,92.5]
[713,"LNT17D","INF917K01FZ1","L&T Midcap Direct Growth",7.5,92.5]
[714,"LNT221","INF917K01AW9","L&T Ultra Short Term Fund - Regular Weekly Dividend",7.5,92.5]
[715,"LNT222","INF917K01AX7","L&T ULTRA STF INST - DAILY DIVIDEND REINVESTMENT PLAN",7.5,92.5]
[716,"LNT222D","INF917K01HX2","L&T Ultra Short Term Direct Daily Dividend Reinvestment",7.5,92.5]
[717,"LNT415D","INF917K01FU2","L&T Infrastructure Direct Dividend",7.5,92.5]
[718,"LNT416D","INF917K01FW8","L&T Infrastructure Direct Growth",7.5,92.5]
[719,"LNTFCEDD","INF917K01LD6","L&T Hybrid Equity Direct Dividend",7.5,92.5]
[720,"LNTFCEGD","INF917K01LE4","L&T Hybrid Equity Direct Growth",7.5,92.5]
[721,"LNTFEFDD","INF917K01FA4","L T FLEXICAP FUND DIRECT PLAN - DIVIDEND",7.5,92.5]
[722,"LNTFEFGD","INF917K01FC0","L T FLEXICAP FUND DIRECT PLAN - GROWTH",7.5,92.5]
[723,"LNTFISDD","INF917K01FR8","L&T Large and MidCap Direct Dividend",7.5,92.5]
[724,"LNTFISGD","INF917K01FT4","L&T Large and MidCap Direct Growth",7.5,92.5]
[725,"LNTFIVDD","INF917K01HB8","L&T India Value Direct Dividend",7.5,92.5]
[726,"LNTFIVDP","INF917K01HC6","L&T India Value Direct Dividend Payout",7.5,92.5]
[727,"LNTFIVGD","INF917K01HD4","L&T India Value Direct Growth",7.5,92.5]
[728,"LNTLEBDG","INF917K01QA1","L&T Emerging Businesses Direct Growth",7.5,92.5]
[729,"LNTLEBDP","INF917K01PZ0","L&T Emerging Businesses Direct Dividend",7.5,92.5]
[730,"LNTLFSGD","INF917K01HH5","L&T Banking and PSU Debt Direct Growth",7.5,92.5]
[731,"LPD1R","INF767K01GM6","LIC MF Banking and PSU Debt Fund-Direct Plan-Daily Dividend-ReInvestment",7.5,92.5]
[732,"LPDDD","INF767K01519","LIC MF Banking and PSU Debt Fund-Regular Plan-Daily DIV DP",7.5,92.5]
[733,"LPDDR","INF767K01527","LIC MF Banking and PSU Debt Fund-Regular Plan-Daily Dividend-ReInvestment",7.5,92.5]
[734,"LPG1G","INF767K01GI4","LIC MF Banking and PSU Debt Fund-Direct Plan-Growth-Growth",7.5,92.5]
[735,"LPGPG","INF767K01535","LIC MF Banking and PSU Debt Fund-Regular Plan-Growth-Growth",7.5,92.5]
[736,"LPM1R","INF767K01GN4","LIC MF Banking and PSU Debt Fund-Direct Plan-Monthly Dividend-ReInvestment",7.5,92.5]
[737,"LPMDR","INF767K01550","LIC MF Banking and PSU Debt Fund-Regular Plan-Monthly Dividend-ReInvestment",7.5,92.5]
[738,"LTOPSTDDR","INF917K01CI4","L&T Short Term Bond Fund - Dividend",7.5,92.5]
[739,"LTOPSTDG","INF917K01CL8","L&T Short Term Bond Fund - Growth",7.5,92.5]
[740,"LTOPSTDQDP","INF917K01CJ2","L&T Short Term Bond Fund - Quarterly Dividend Payout",7.5,92.5]
[741,"LTOPSTDQDR","INF917K01CK0","L&T Short Term Bond Fund - Quarterly Dividend",7.5,92.5]
[742,"MBALF-DP","INF200K01115","SBI Equity Hybrid Fund Regular Dividend Payout",7.5,92.5]
[743,"MBALF-DR","INF200K01123","SBI Equity Hybrid Fund Regular Dividend",7.5,92.5]
[744,"MBALF-G","INF200K01107","SBI Equity Hybrid Fund Regular Growth",7.5,92.5]
[745,"MEF-DP","INF200K01198","SBI Magnum Equity ESG Fund Regular Dividend Payout",7.5,92.5]
[746,"MEF-DR","INF200K01206","SBI Magnum Equity ESG Fund Regular Dividend",7.5,92.5]
[747,"MEF-G","INF200K01214","SBI Magnum Equity ESG Fund Regular Growth",7.5,92.5]
[748,"MFDP","INF247L01171","Motilal Oswal Focused 25 FundRegular DividendPayout",7.5,92.5]
[749,"MFDP","INF247L01163","Motilal Oswal Focused 25 FundRegular DividendReinvestment",7.5,92.5]
[750,"MFGP","INF247L01155","Motilal Oswal Focused 25 FundRegular Growth",7.5,92.5]
[751,"MGLF-94-DP","INF200K01255","MAGNUM GLOBAL FUND",7.5,92.5]
[752,"MGLF-94-DR","INF200K01263","MAGNUM GLOBAL FUND",7.5,92.5]
[753,"MGLF-94-G","INF200K01271","SBI MAGNUM GLOBAL FUND - REGULAR PLAN - GROWTH",7.5,92.5]
[754,"MIDCAP-DP","INF200K01578","MAGNUM MIDCAP FUND",7.5,92.5]
[755,"MIDCAP-DR","INF200K01586","MAGNUM MIDCAP FUND",7.5,92.5]
[756,"MIDCAP-G","INF200K01560","MAGNUM MIDCAP FUND",7.5,92.5]
[757,"MIRAEEBD1","INF769K01BI1","MIRAE ASSET EMERGING BLUECHIP DIRECT GROWTH OPTION",7.5,92.5]
[758,"MIRAEEBD2","INF769K01BJ9","MIRAE ASSET EMERGING BLUECHIP DIRECT DIVI OPTION P",7.5,92.5]
[759,"MIRAEEBD2","INF769K01BK7","MIRAE ASSET EMERGING BLUECHIP DIRECT DIVI OPTION R",7.5,92.5]
[760,"MIRAEEBRDD","INF769K01127","MIRAE ASSET EMERGING BLUECHIP REGULAR DIVI PAYOUT",7.5,92.5]
[761,"MIRAEEBRDR","INF769K01119","MIRAE ASSET EMERGING BLUECHIP REGULAR DIVI REINVEST",7.5,92.5]
[762,"MIRAEEBRGG","INF769K01101","MIRAE ASSET EMERGING BLUECHIP REGULAR GROWTH",7.5,92.5]
[763,"MIRAEIOD1","INF769K01AX2","Mirae Asset Large Cap Fund Direct Plan Growth PlanGrowth",7.5,92.5]
[764,"MIRAEIOD2","INF769K01AY0","Mirae Asset Mutual Fund Large Cap Fund-Direct Plan - Dividend-Payout",7.5,92.5]
[765,"MIRAEIOD2","INF769K01AZ7","Mirae Asset Mutual Fund Large Cap Fund-Direct Plan - Dividend-Reinvestment",7.5,92.5]
[766,"MIRAEIORDD","INF769K01036","Mirae Asset Mutual Fund Large Cap Fund-Regular Dividend Plan-Payout",7.5,92.5]
[767,"MIRAEIORDR","INF769K01028","Mirae Asset Mutual Fund Large Cap Fund-Regular Dividend Plan-Reinvestment",7.5,92.5]
[768,"MIRAEIORGG","INF769K01010","Mirae Asset Mutual Fund Large Cap Fund-Regular Growth Plan-Growth",7.5,92.5]
[769,"MIRAEPFD1","INF769K01DH9","Mirae Asset Hybrid Equity FundDirect Plan GrowthGrowth",7.5,92.5]
[770,"MIRAEPFD2","INF769K01DI7","Mirae Asset Hybrid - Equity FundDirect Plan - Dividend",7.5,92.5]
[771,"MIRAEPFD2","INF769K01DJ5","Mirae Asset Hybrid - Equity FundDirect Plan - Dividend",7.5,92.5]
[772,"MIRAEPFRGG","INF769K01DE6","Mirae Asset Hybrid - Equity FundRegular Growth Plan",7.5,92.5]
[773,"MLIF-98-DP","INF200K01610","MAGNUM INCOME FUND - 1998",7.5,92.5]
[774,"MLIF-98-DR","INF200K01628","MAGNUM INCOME FUND - 1998",7.5,92.5]
[775,"MLIF-98-G","INF200K01594","SBI MAGNUM INCOME FUND - REGULAR PLAN - GROWTH",7.5,92.5]
[776,"MMPS-DP","INF200K01289","SBI Large & Midcap Fund Regular Dividend Payout",7.5,92.5]
[777,"MMPS-DR","INF200K01297","SBI Large & Midcap Fund Regular Dividend",7.5,92.5]
[778,"MMPS-G","INF200K01305","SBI Large & Midcap Fund Regular Growth",7.5,92.5]
[779,"MMULTI-DP","INF200K01230","MAGNUM MULTICAP FUND",7.5,92.5]
[780,"MMULTI-DR","INF200K01248","MAGNUM MULTICAP FUND",7.5,92.5]
[781,"MMULTI-G","INF200K01222","MAGNUM MULTICAP FUND",7.5,92.5]
[782,"MOFFMGDG","INF247L01445","Motilal Oswal Midcap 30 FundDirect Growth",7.5,92.5]
[783,"MOFFMPDR","INF247L01452","Motilal Oswal Midcap 30 FundDirect DividendReinvestment",7.5,92.5]
[784,"MOFMDPD","INF247L01437","Motilal Oswal Midcap 30 FundRegular DividendPayout",7.5,92.5]
[785,"MOFMDPR","INF247L01429","Motilal Oswal Midcap 30 FundRegular DividendReinvestment",7.5,92.5]
[786,"MOFMGPG","INF247L01411","Motilal Oswal Midcap 30 FundRegular Growth",7.5,92.5]
[787,"MSF-CON-DP","INF200K01347","SBI CONTRA FUND",8.5,91.5]
[788,"MSF-CON-DR","INF200K01354","SBI CONTRA FUND",8.5,91.5]
[789,"MSF-CON-G","INF200K01362","SBI CONTRA FUND",8.5,91.5]
[790,"MSF-EBF-DP","INF200K01388","SBI Focused Equity Fund Regular Dividend Payout",7.5,92.5]
[791,"MSF-EBF-DR","INF200K01396","SBI Focused Equity Fund Regular Dividend",7.5,92.5]
[792,"MSF-EBF-G","INF200K01370","SBI Focused Equity Fund Regular Growth",7.5,92.5]
[793,"MSF-PHA-DP","INF200K01453","SBI Healthcare Opportunities Fund Regular Dividend Payout",7.5,92.5]
[794,"MSF-PHA-DR","INF200K01461","SBI Healthcare Opportunities Fund Regular Dividend",7.5,92.5]
[795,"MSF-PHA-G","INF200K01446","SBI Healthcare Opportunities Fund Regular Growth",7.5,92.5]
[796,"PB208MD","INF178L01BP8","KOTAK CORPORATEBOND FUND STANDARD PLAN MONTHLY DIV REI",7.5,92.5]
[797,"PLTVFDP","INF879O01027","Parag Parikh Flexi Cap Fund - Direct Plan",7.5,92.5]
[798,"PLTVFRPA","INF879O01019","Parag Parikh Flexi Cap Fund -Regular Plan",7.5,92.5]
[799,"PMFEBRD","INF173K01163","PRINCIPAL EMERGING BLUECHIP FUND HALF YEARLY DIVIDEND PAYOUT",7.5,92.5]
[800,"PMFEBRD","INF173K01171","PRINCIPAL EMERGING BLUECHIP FUND HALF YEARLY DIVIDEND REINVESTMENT",7.5,92.5]
[801,"PMFEBRG","INF173K01155","PRINCIPAL EMERGING BLUECHIP FUND - GROWTH OPTION",7.5,92.5]
[802,"PMFEBZG","INF173K01EG4","PRINCIPAL EMERGING BLUECHIP DIRECT GROWTH",7.5,92.5]
[803,"PMFEBZP","INF173K01EH2","PRINCIPAL EMERGING BLUECHIP DIRECT HALF YEARLY DIVI REINVEST",7.5,92.5]
[804,"PMFSBDP","INF173K01CI4","Principal Hybrid Equity Fund - Regular Plan - Monthly Dividend Payout",7.5,92.5]
[805,"PMFSBDP","INF173K01CJ2","Principal Hybrid Equity Fund - Regular Plan - Monthly Dividend Reinvestment",7.5,92.5]
[806,"PMFSBGP","INF173K01CL8","Principal Hybrid Equity Fund - Regular Plan Growth",7.5,92.5]
[807,"PMFSBZG","INF173K01FE6","Principal Hybrid Equity Fund - Direct Plan Growth",7.5,92.5]
[808,"PMFSBZP","INF173K01FC0","Principal Hybrid Equity Fund - Direct Plan - Monthly Dividend Reinvestment",7.5,92.5]
[809,"RBAPSUDGR","INF204KA1U53","Nippon India BANKING & PSU DEBT DIRECT GROWTH",7.5,92.5]
[810,"RBAPSUDMDR","INF204KA1V45","Nippon India BANKING & PSU DEBT DIRECT MONTHLY DIVI -REINVEST",7.5,92.5]
[811,"RBAPSUDP","INF204KA1T72","Nippon India BANKING & PSU DEBT DIVIDEND -DIVIDEND PAYOUT OPTION",7.5,92.5]
[812,"RBAPSUDR","INF204KA1T80","Nippon India BANKING & PSU DEBT DIVIDEND -REINVESTMENT OPTION",7.5,92.5]
[813,"RBAPSUDWDR","INF204KA1V29","Nippon India BANKING & PSU DEBT DIRECT WEEKLY DIVI -REINVEST",7.5,92.5]
[814,"RBAPSUGR","INF204KA1T56","Nippon India BANKING & PSU DEBT GROWTH -GROWTH OPTION",7.5,92.5]
[815,"RBAPSUMDP","INF204KA1U38","Nippon India BANKING & PSU DEBT MONTHLY DIVIDEND -DIV PAYOUT OPTION",7.5,92.5]
[816,"RBAPSUMDR","INF204KA1U46","Nippon India BANKING & PSU DEBT MONTHLY DIV -REINVESTMENT OPTION",7.5,92.5]
[817,"REL200DPDP","INF204K01XG7","Nippon India Large Cap Fund - Direct Dividend Plan",7.5,92.5]
[818,"REL200DPDP","INF204K01XH5","Nippon India Large Cap Fund - Direct Dividend Plan",7.5,92.5]
[819,"REL200DPGP","INF204K01XI3","Nippon India Large Cap Fund - Direct Growth Plan Growth Option",7.5,92.5]
[820,"RELABDPMDP","INF204KA1MV7","Nippon India Arbitrage Fund - Direct Monthly Dividend Plan",7.5,92.5]
[821,"RELABDPMDR","INF204KA1MW5","Nippon India Arbitrage Fund - Direct Monthly Dividend Plan",7.5,92.5]
[822,"RELABRDMDP","INF204KA1MT1","Nippon India Arbitrage Fund - Monthly Dividend Plan",7.5,92.5]
[823,"RELABRDMDR","INF204KA1MU9","Nippon India Arbitrage Fund - Monthly Dividend Plan",7.5,92.5]
[824,"RELABTDPDP","INF204K01YA8","Nippon India Arbitrage Fund - Direct Dividend Plan",7.5,92.5]
[825,"RELABTDPDP","INF204K01YB6","Nippon India Arbitrage Fund - Direct Dividend Plan",7.5,92.5]
[826,"RELABTDPGR","INF204K01XZ7","Nippon India Arbitrage Fund - Direct Growth Plan Growth Option",7.5,92.5]
[827,"RELABTGADP","INF204K01IZ8","Nippon India arbtrge adv DP",7.5,92.5]
[828,"RELABTGADR","INF204K01JA9","Nippon India arbtrge adv DR",7.5,92.5]
[829,"RELABTGAGF","INF204K01IY1","Nippon India arbtrge adv GR",7.5,92.5]
[830,"RELBANDPDP","INF204K01XN3","Nippon India BANKING FUND DIRECT PLAN DIVIDEND PLAN DIVIDEND REINVESTMENT",7.5,92.5]
[831,"RELBANDPGP","INF204K01XO1","Nippon India BANKING FUND DIRECT PLAN GROWTH PLAN GROWTH",7.5,92.5]
[832,"RELBANKGDP","INF204K01893","Nippon India BANKING FUND- DIVIDEND PLAN-DIVIDEND PAYOUT OPTION",7.5,92.5]
[833,"RELBANKGDR","INF204K01901","Nippon India BANKING FUND DIVIDEND PLAN DIVIDEND REINVESTMENT OPT",7.5,92.5]
[834,"RELBANKGGP","INF204K01927","Nippon India BANKING FUND- GROWTH PLAN- GROWTH OPTION",8.5,91.5]
[835,"RELEQADVGP","INF204K01562","Nippon India Large Cap Fund - Growth Plan Growth Option",7.5,92.5]
[836,"RELEQOPPDP","INF204K01455","Nippon India Multi Cap Fund - Dividend Plan",8.5,91.5]
[837,"RELEQOPPDR","INF204K01463","Nippon India EQUITY OPP FUND - RETAIL PLAN -DIVIDEND REINVESTMENT OPTION",8.5,91.5]
[838,"RELEQOPPGP","INF204K01489","Nippon India Multi Cap Fund - Growth Plan Growth Option",8.5,91.5]
[839,"RELFLRFMDR","INF204K01CK3","Nippon India Floating Rate Fund - Monthly Dividend Plan",7.5,92.5]
[840,"RELFLRTFGP","INF204K01CG1","Nippon India Floating Rate Fund - Growth Plan",7.75,92.25]
[841,"RELFSHDPGP","INF204K01E05","Nippon India Floating Rate Fund - Direct Growth Plan",7.5,92.5]
[842,"RELGRODPDP","INF204K01E47","Nippon India GROWTH FUND DIRECT PLAN DIVIDEND PLAN DIVIDEND REINVESTMENT",7.5,92.5]
[843,"RELGROWTDP","INF204K01299","Nippon India GROWTH FUND - DIVIDEND PLAN- DIVIDEND PAYOUT OPTION",8.5,91.5]
[844,"RELGROWTDR","INF204K01307","Nippon India GROWTH FUND - DIVIDEND PLAN - DIV REINVESTMENT OPT",8.5,91.5]
[845,"RELGROWTGP","INF204K01323","Nippon India GROWTH FUND - GROWTH PLAN - GROWTH OPTION",8.5,91.5]
[846,"RELIGARECF","INF205K01205","INVESCO INDIA CONTRA FUND",7.5,92.5]
[847,"RELIGARECF","INF205K01189","INVESCO INDIA CONTRA FUND",7.5,92.5]
[848,"RELIGARECF","INF205K01197","INVESCO INDIA CONTRA FUND",7.5,92.5]
[849,"RELIGAREGF","INF205K01262","INVESCO INDIA GROWTH OPPORTUNITIES FUND - DIVIDEND",7.5,92.5]
[850,"RELIGAREGF","INF205K01247","INVESCO INDIA GROWTH OPPORTUNITIES FUND - GROWTH",7.5,92.5]
[851,"RELIGAREGF","INF205K01254","INVESCO INDIA GROWTH OPPORTUNITIES FUND - DIVIDEND",7.5,92.5]
[852,"RELLNGEQDP","INF204K01GF4","Nippon India Focused Equity Fund Dividend Payout",7.5,92.5]
[853,"RELLNGEQDR","INF204K01GG2","Nippon India Focused Equity Fund Dividend Reinvestment",7.5,92.5]
[854,"RELLNGEQGP","INF204K01GE7","Nippon India Focused Equity Fund Growth Plan",7.5,92.5]
[855,"RELLTEDPDP","INF204K01F87","Nippon India Focused Equity Fund Direct Dividend Reinvestment",7.5,92.5]
[856,"RELLTEDPGP","INF204K01F95","Nippon India Focused Equity Fund Direct Growth",7.5,92.5]
[857,"RELMMFDPMD","INF204K01ZY5","Nippon India Low Duration Fund - Direct Monthly Dividend Plan",7.5,92.5]
[858,"RELMMFIDDR","INF204KA1EJ9","Nippon India Low Duration Fund - Dividend Plan",7.5,92.5]
[859,"RELMMGRMDR","INF204K01ES2","Nippon India Low Duration Fund - Retail Option - Monthly Dividend Plan",7.5,92.5]
[860,"RELMMIGPG","INF204K01EV6","Nippon India Low Duration Fund - Growth Plan Growth Option",7.5,92.5]
[861,"RELMMIQDR","INF204K01FC3","Nippon India Low Duration Fund - Quarterly Dividend Plan",7.5,92.5]
[862,"RELNRIDPDP","INF204K01G86","Nippon India Balanced Advantage Fund - Direct Dividend Plan",7.5,92.5]
[863,"RELNRIDPGP","INF204K01G94","Nippon India Balanced Advantage Fund - Direct Growth Plan",7.5,92.5]
[864,"RELNRIRPDP","INF204K01570","NIPPON INDIA BALANCED ADVANTAGE FUND-DIVIDEND PLAN-PAYOUT",7.5,92.5]
[865,"RELNRIRPDR","INF204K01588","NIPPON INDIA BALANCED ADVANTAGE FUND-DIVIDEND PLAN-REINVESTMENT",7.5,92.5]
[866,"RELNRIRPGR","INF204K01604","NIPPON INDIA BALANCED ADVANTAGE FUND-GROWTH PLAN-GROWTH OPTION",7.5,92.5]
[867,"RELOPPDPDP","INF204K01XD4","Nippon India Multi Cap Fund - Direct Dividend Plan",7.5,92.5]
[868,"RELOPPDPDP","INF204K01XE2","Nippon India Multi Cap Fund - Direct Dividend Plan",7.5,92.5]
[869,"RELOPPDPGP","INF204K01XF9","Nippon India Multi Cap Fund - Direct Growth Plan Growth Option",7.5,92.5]
[870,"RELPHADPDP","INF204K01I43","Nippon India PHARMA FUND DIRECT PLAN DIVIDEND PLAN DIVIDEND REINVESTMENT",7.5,92.5]
[871,"RELPHADPGP","INF204K01I50","Nippon India PHARMA FUND DIRECT PLAN GROWTH PLAN - GROWTH OPTION GROWTH",7.5,92.5]
[872,"RELPHARMDP","INF204K01935","Nippon India PHARMA FUND-DIVIDEND PLAN-DIVIDEND PAYOUT OPTION",7.5,92.5]
[873,"RELPHARMDR","INF204K01943","Nippon India PHARMA FUND-DIVIDEND PLAN -DIVIDEND REINVESTMENT OPTION",7.5,92.5]
[874,"RELPHARMGP","INF204K01968","Nippon India PHARMA FUND-GROWTH PLAN-GROWTH OPTION",7.5,92.5]
[875,"RELREGSBGP","INF204K01FW1","Nippon India Equity Hybrid Fund Plan - Growth Plan Growth Option",7.5,92.5]
[876,"RELREGSEDP","INF204K01GC1","Nippon India Value Fund - Dividend Plan",7.5,92.5]
[877,"RELREGSEDR","INF204K01GD9","Nippon India Value Fund - Dividend Plan",7.5,92.5]
[878,"RELREGSEGP","INF204K01GB3","Nippon India Value Fund Plan - Growth Plan Growth Option",8.5,91.5]
[879,"RELRSBDPDP","INF204K01B24","Nippon India Equity Hybrid Fund - Direct Dividend Plan",7.5,92.5]
[880,"RELRSBDPGP","INF204K01B08","Nippon India Equity Hybrid Fund Plan-Direct Growth Plan Growth Option",7.5,92.5]
[881,"RELRSEDPDP","INF204K01K31","Nippon India Value Fund - Direct Dividend Plan",7.5,92.5]
[882,"RELRSEDPGP","INF204K01K49","Nippon India Value Fund Plan - Direct Growth Plan Growth Option",7.5,92.5]
[883,"RELSHODPDP","INF204K01B40","Nippon India SHORT TERM FUND DIRECT PLAN DIVIDEND PLAN DIVIDEND PAYOUT",7.5,92.5]
[884,"RELSHODPGP","INF204K01B32","Nippon India SHORT TERM FUND DIRECT PLAN GROWTH PLAN GROWTH",7.5,92.5]
[885,"RELSHORTDR","INF204KA1ER2","Nippon India SHORT TERM FUND DIVIDEND PLAN DIVIDEND REINVESTMENT",7.5,92.5]
[886,"RELSHORTGP","INF204K01FL4","Nippon India SHORT TERM FUND-GROWTH PLAN - GROWTH OPTION",8,92]
[887,"RELSHORTMP","INF204K01FM2","Nippon India SHORT TERM FUND-DIVIDEND PLAN - MONTHLY DIVIDEND PAYOUT OPTION",7.5,92.5]
[888,"RELSHORTMR","INF204K01FN0","Nippon India SHORT TERM FUND-DIVIDEND PLAN - MONTHLY DIVIDEND REINVESTMENT OPT",7.5,92.5]
[889,"RELSHORTQR","INF204K01FP5","Nippon India SHORT TERM FUND-DIVIDEND PLAN - QUARTERLY DIV REINVESTMENT OPT",7.5,92.5]
[890,"RELSMADPDP","INF204K01J91","Nippon India SMALL CAP FUND DIRECT PLAN DIVIDEND PLAN DIVIDEND PAYOUT",7.5,92.5]
[891,"RELSMADPDP","INF204K01K07","Nippon India SMALL CAP FUND DIRECT PLAN DIVIDEND PLAN DIVIDEND REINVESTMENT",7.5,92.5]
[892,"RELSMADPGP","INF204K01K15","Nippon India SMALL CAP FUND DIRECT PLAN GROWTH PLAN GROWTH",7.5,92.5]
[893,"RELSMLCPDP","INF204K01IA1","Nippon India SMALL CAP FUND - DIVIDEND PLAN - DIVIDEND PAYOUT OPTION",7.5,92.5]
[894,"RELSMLCPDR","INF204K01IB9","Nippon India SMALL CAP FUND - DIVIDEND PLAN - REINVESTMENT OPTION",7.5,92.5]
[895,"RELSMLCPGR","INF204K01HY3","Nippon India SMALL CAP FUND - GROWTH PLAN - GROWTH OPTION",7.5,92.5]
[896,"RELVISDPDP","INF204K01F12","Nippon India VISION FUND DIRECT PLAN DIVIDEND PLAN DIVIDEND REINVESTMENT",7.5,92.5]
[897,"RELVISINDP","INF204K01372","Nippon India VISION FUND- DIVIDENDS PLAN - DIVIDEND PAYOUT OPTION",8.5,91.5]
[898,"RELVISINDR","INF204K01380","Nippon India VISION FUND - DIVIDEND PLAN - DIV REINVESTMENT OPT",8.5,91.5]
[899,"RELVISINGP","INF204K01406","Nippon India VISION FUND - GROWTH PLAN - GROWTH OPTION",8.5,91.5]
[900,"RGFCFD1GR","INF205K01LE4","Invesco India Contra Fund - Direct Growth",7.5,92.5]
[901,"RGFUSMR","INF205K01IC4","INVESCO INDIA TREASURY ADVANTAGE FUND - MONTHLY DIVIDEND",7.5,92.5]
[902,"RMFAIFAMDR","INF205K01RO0","INVESCO INDIA CORPORATE BOND FUND - MON DIV REINVESTMENT",7.5,92.5]
[903,"RMFNLGPGR","INF204KB1ZB0","Nippon India NIVESH LAKSHYA FUND - GROWTH PLANGROWTH",7.5,92.5]
[904,"RMFNLMPDR","INF204KB1ZF1","Nippon India NIVESH LAKSHYA FUND - MONTHLY DIVIDEND PLANREINVESTMENT",7.5,92.5]
[905,"SAOF-DP","INF200K01131","SBI ARBITRAGE OPPORTUNITIES FUND",7.5,92.5]
[906,"SAOF-DR","INF200K01149","SBI ARBITRAGE OPPORTUNITIES FUND",7.5,92.5]
[907,"SAOF-G","INF200K01156","SBI ARBITRAGE OPPORTUNITIES FUND",7.5,92.5]
[908,"SBCF-DP","INF200K01164","SBI BLUE CHIP FUND",7.5,92.5]
[909,"SBCF-DR","INF200K01172","SBI BLUE CHIP FUND",7.5,92.5]
[910,"SBCF-G","INF200K01180","SBI BLUE CHIP FUND",7.5,92.5]
[911,"SBIARDD","INF200K01QT2","SBI Arbitrage Opportunities Fund - Direct Plan - Dividend",7.5,92.5]
[912,"SBIBCDG","INF200K01QX4","SBI Blue Chip Fund - Direct Plan - Growth",7.5,92.5]
[913,"SBIBFSFDP","INF200KA1481","SBI BANKING & FINANCIAL SERVICES FUND - REGULAR PLAN - DIVIDEND PAYOUT",7.5,92.5]
[914,"SBIBFSFDR","INF200KA1499","SBI BANKING & FINANCIAL SERVICES FUND - REGULAR PLAN - DIV REINVESTMENT",7.5,92.5]
[915,"SBIBFSFGR","INF200KA1473","SBI BANKING & FINANCIAL SERVICES FUND - REGULAR PLAN - GROWTH",7.5,92.5]
[916,"SBIDYBFUND","INF200K01958","SBI DYNAMIC BOND FUND GROWTH",7.5,92.5]
[917,"SBIDYBFUND","INF200K01966","SBI DYNAMIC BOND FUND DIVIDEND PAYOUT",7.5,92.5]
[918,"SBIDYBFUND","INF200K01974","SBI DYNAMIC BOND FUND DIVIDEND REINVESTMENT",7.5,92.5]
[919,"SBIESFRDPM","INF200KA1DB2","SBI EQUITY SAVINGS REGULAR PLAN MONTHLY DIVIDEND PAYOUT",7.5,92.5]
[920,"SBIESFRDPQ","INF200KA1DD8","SBI EQUITY SAVINGS REGULAR PLAN QUARTERLY DIVIDEND PAYOUT",7.5,92.5]
[921,"SBIESFRDRM","INF200KA1DC0","SBI EQUITY SAVINGS REGULAR PLAN MONTHLY DIVIDEND REINVEST",7.5,92.5]
[922,"SBIESFRDRQ","INF200KA1DE6","SBI EQUITY SAVINGS REGULAR PLAN QUARTERLY DIVIDEND REINVEST",7.5,92.5]
[923,"SBIESFRG","INF200KA1DA4","SBI EQUITY SAVINGS REGULAR PLAN GROWTH",7.5,92.5]
[924,"SBILDDG","INF200K01VM7","SBI Magnum Low Duration Fund Direct Growth",7.5,92.5]
[925,"SBIMIFINVP","INF200K01719","SBI Magnum Medium Duration Fund Regular Growth",7.5,92.5]
[926,"SBIMIFINVP","INF200K01727","SBI Magnum Medium Duration Fund Regular Dividend Payout",7.5,92.5]
[927,"SBIMIFINVP","INF200K01735","SBI Magnum Medium Duration Fund Regular Dividend",7.5,92.5]
[928,"SBISHDFIGR","INF200K01HZ8","SBI SHORT TERM DEBT FUND",7.5,92.5]
[929,"SBISHFIFDP","INF200K01HT1","SBI SHORT TERM DEBT FUND",7.5,92.5]
[930,"SBISHFIFDR","INF200K01HU9","SBI SHORT TERM DEBT FUND",7.5,92.5]
[931,"SBISHFIMDP","INF200K01HV7","SBI SHORT TERM DEBT FUND",7.5,92.5]
[932,"SBISHFIMDR","INF200K01HW5","SBI SHORT TERM DEBT FUND",7.5,92.5]
[933,"SBISHFURGR","INF200K01MO2","SBI Magnum Low Duration Fund Regular Growth",7.5,92.5]
[934,"SBISHURMDR","INF200K01MQ7","SBI Magnum Low Duration Fund Regular Monthly Dividend",7.5,92.5]
[935,"SBISMCF","INF200K01T28","SBI Small Cap Fund Regular Growth",7.5,92.5]
[936,"SBISMCF","INF200K01T36","SBI Small Cap Fund Regular Dividend Payout",7.5,92.5]
[937,"SBISMCF","INF200K01T44","SBI Small Cap Fund Regular Dividend",7.5,92.5]
[938,"SBISTDG","INF200K01VE4","SBI Short Term Debt Fund - Direct Plan - Growth",7.5,92.5]
[939,"SBNPPEQU52","INF903J01173","SUNDARAM MID CAP FUND REGULAR GROWTH",8.5,91.5]
[940,"SBNPPEQU53","INF903J01181","SUNDARAM MID CAP FUND REGULAR DIVIDEND",7.5,92.5]
[941,"SBNPPEQU53","INF903J01199","SUNDARAM MID CAP FUND REGULAR DIVIDEND",7.5,92.5]
[942,"SCBF566D","INF200KA1YT0","SBI Corporate Bond Fund - Direct Plan - Monthly Dividend",7.5,92.5]
[943,"SCBF566G","INF200KA1YR4","SBI Corporate Bond Fund - Direct Plan - Growth",7.5,92.5]
[944,"SCBF566QP","INF200KA1YM5","SBI Corporate Bond Fund - Regular Plan Growth",7.5,92.5]
[945,"SCBF566QP","INF200KA1YP8","SBI Corporate Bond Fund-Regular Plan Quarterly Div Payout",7.5,92.5]
[946,"SCBFD566D","INF200KA1YO1","SBI Corporate Bond Fund - Regular Plan Monthly Dividend",7.5,92.5]
[947,"SCBFD566G","INF200KA1YS2","SBI Corporate Bond Fund - Direct Plan - Monthly Dividend Payout",7.5,92.5]
[948,"SCBFD566P","INF200KA1YN3","SBI Corporate Bond Fund - Regular Plan Monthly Dividend Payout",7.5,92.5]
[949,"SCBFD566Q","INF200KA1YQ6","SBI Corporate Bond Fund - Regular Plan Quarterly Dividend",7.5,92.5]
[950,"SFDPD","INF789FB1RH4","UTI - Arbitrage Fund - Div Payout",7.5,92.5]
[951,"SFDPR","INF789FB1RI2","UTI - Arbitrage Fund - Div Reinvestment",7.5,92.5]
[952,"SFGPG","INF789FB1RJ0","UTI - Arbitrage Fund - Growth",7.5,92.5]
[953,"SFIPRG","INF903J01HW6","SUNDARAM CORPORATE BOND FUND REGULAR GROWTH",7.5,92.5]
[954,"SFSTPRB","INF903J01LY4","SUNDARAM BANKING & PSU DEBT FUND - REGULAR - BONUS",7.5,92.5]
[955,"SFSTPRG","INF903J01IN3","SUNDARAM BANKING & PSU DEBT FUND - REGULAR - GROWTH",7.5,92.5]
[956,"SFSTPRMDR","INF903J01IR4","SUNDARAM BANKING & PSU DEBT FUND - REGULAR - MONTHLY DIV RNST",7.5,92.5]
[957,"SMFEMDP","INF903J01DU9","SUNDARAM LARGE AND MID CAP FUND REGULAR DIVIDEND",7.5,92.5]
[958,"SMFEMDR","INF903J01DV7","SUNDARAM LARGE AND MID CAP FUND REGULAR DIVIDEND",7.5,92.5]
[959,"SMFEMG","INF903J01DT1","SUNDARAM LARGE AND MID CAP FUND REGULAR GROWTH",7.5,92.5]
[960,"SMMFDG","INF200K01UG1","SBI Magnum Multicap Fund - Direct Plan - Growth",7.5,92.5]
[961,"SPEQU22","INF903J01546","SUNDARAM RURAL AND CONSUMPTION FUND REGULAR DIVIDEND",7.5,92.5]
[962,"SPEQU23","INF903J01553","SUNDARAM RURAL AND CONSUMPTION FUND REGULAR DIVIDEND",7.5,92.5]
[963,"SPEQU24","INF903J01561","SUNDARAM RURAL AND CONSUMPTION FUND REGULAR GROWTH",7.5,92.5]
[964,"SPEQU40","INF903J01728","SUNDARAM EQUITY HYBRID FUND REGULAR DIVIDEND",7.5,92.5]
[965,"SPEQU41","INF903J01736","SUNDARAM EQUITY HYBRID FUND REGULAR DIVIDEND",7.5,92.5]
[966,"SPEQU42","INF903J01744","SUNDARAM EQUITY HYBRID FUND REGULAR GROWTH",7.5,92.5]
[967,"STAIR","INF789FA1R09","UTI SHORT TERM INCOME INSTITUTIONAL ANNUAL DIV REINVEST",7.5,92.5]
[968,"STIGG","INF789F01QA4","UTI SHORT TERM INCOME FUND INSTITUTIONAL PLAN GROWTH",7.5,92.5]
[969,"STQDR","INF789FA1R58","UTI SHORT TERM INCOME INSITUTIONAL QUARTERLY DIV REINVEST",7.5,92.5]
[970,"STSG","INF178L01202","KOTAK LOW DURATION FUND STANDARD GROWTH",7.5,92.5]
[971,"STSMDR","INF178L01228","KOTAK LOW DURATION FUND STANDARD MONTHLY DIVIDEND REINVESTMENT",7.5,92.5]
[972,"TAFA","INF277K016Q5","Tata Arbitrage Fund-Monthly Dividend Payout",7.5,92.5]
[973,"TAFB","INF277K015Q7","Tata Arbitrage Fund Regular - Plan Growth",7.5,92.5]
[974,"TAFCDP","INF277K018Q1","Tata Arbitrage Fund Direct Plan - Monthly Dividend Payout",7.5,92.5]
[975,"TAFD","INF277K017Q3","Tata Arbitrage Fund Direct Plan - Growth Option",7.5,92.5]
[976,"TATABFD","INF277K01DB6","Tata Hybrid Equity Fund Regular Plan - Periodic Dividend Payout",7.5,92.5]
[977,"TATABFD","INF277K01295","Tata Hybrid Equity Fund Regular Plan - Periodic Dividend Reinvestment",7.5,92.5]
[978,"TATABFG","INF277K01303","Tata Hybrid Equity Fund Regular Plan - Growth",7.5,92.5]
[979,"TATABFMD","INF277K01CS2","Tata Hybrid Equity Fund Regular Plan - Monthly Dividend Payout",7.5,92.5]
[980,"TATABFMD","INF277K01CW4","Tata Hybrid Equity Fund Regular Plan - Monthly Dividend Reinvestment",7.5,92.5]
[981,"TATAEOD","INF277K01DH3","Tata Large & Mid Cap Fund-Regular Plan-Dividend Payout",7.5,92.5]
[982,"TATAEOD","INF277K01410","Tata Large & Mid Cap Fund-Regular Plan-Dividend Reinvestment",7.5,92.5]
[983,"TATAEOG","INF277K01428","Tata Large & Mid Cap Fund-Regular Plan-Growth",7.5,92.5]
[984,"TATAEPE5","INF277K01DI1","TATA EQUITY P/E FUND DIVIDEND TRIGGER OPTION A (5 PERCENTAGE)",7.5,92.5]
[985,"TATAEPE5","INF277K01436","Tata Equity P/E Fund Regular Plan-Div Trigger A (5%)",7.5,92.5]
[986,"TATAEPE5Z","INF277K01NA7","Tata Equity P/E Fund Direct Plan-Div Trigger A (5%)",7.5,92.5]
[987,"TATAEPED","INF277K01444","Tata Equity P/E Fund Regular Plan-Div Trigger B(10%)",7.5,92.5]
[988,"TATAEPEDP","INF277K01DJ9","Tata Equity P/E Fund Regular Plan-Div Trigger B(10%)",7.5,92.5]
[989,"TATAEPEDZ","INF277K01NC3","Tata Equity P/E Fund Direct Plan-Div Trigger B(10%)",7.5,92.5]
[990,"TATAEPEG","INF277K01451","Tata Equity P/E Fund Regular Plan-Growth",7.5,92.5]
[991,"TATAEPEGZ","INF277K01ND1","Tata Equity P/E Fund Direct Plan-Growth",7.5,92.5]
[992,"TATAICFGZ","INF277K013A6","TATA INDIA CONSUMER FUND DIRECT PLAN GROWTH",7.5,92.5]
[993,"TATASTD","INF277K01EI9","TATA SHORT TERM BOND FUND REGULAR PLAN - MONTHLY DIVIDEND PAYOUT",7.5,92.5]
[994,"TATASTD","INF277K01964","TATA SHORT TERM BOND FUND REGULAR PLAN - MONTHLY DIVIDEND REINVESTMENT",7.5,92.5]
[995,"TATASTG","INF277K01972","TATA SHORT TERM BOND FUND - GROWTH",7.5,92.5]
[996,"TEGFD","INF277K01MN2","Tata Hybrid Equity Fund Direct Plan - Growth",7.5,92.5]
[997,"TEGFE","INF277K01MM4","Tata Hybrid Equity Fund Direct Plan - Periodic Dividend Reinvestment",7.5,92.5]
[998,"TEGFF","INF277K01MO0","Tata Hybrid Equity Fund Direct Plan - Monthly Dividend Payout",7.5,92.5]
[999,"TEGFF","INF277K01MP7","Tata Hybrid Equity Fund Direct Plan - Monthly Dividend Reinvestment",7.5,92.5]
[1000,"TEOF","INF277K01MJ0","Tata Large & Mid Cap Fund-Direct Plan-Dividend Reinvestment",7.5,92.5]
[1001,"TICFDP","INF277K011A0","TATA INDIA CONSUMER FUND-REGULAR PLAN-DIVIDEND PAYOUT",7.5,92.5]
[1002,"TICFG","INF277K010A2","TATA INDIA CONSUMER FUND-REGULAR PLAN-GROWTH",7.5,92.5]
[1003,"TRSFM","INF277K01FH8","TATA RETIREMENT SAVINGS FUND MODERATE PLAN",7.5,92.5]
[1004,"TRSFMB","INF277K01QN3","TATA RETIREMENT SAVINGS FUND-MODERATE DIRECT PLAN - GROWTH",7.5,92.5]
[1005,"TSTBF","INF277K01QR4","TATA SHORT TERM BOND FUND DIRECT PLAN - GROWTH",7.5,92.5]
[1006,"TSTBFE","INF277K01P20","TATA SHORT TERM BOND - A PERIODIC DIVIDEND/BONUS REINVESTMENT",7.5,92.5]
[1007,"TSTBFF","INF277K01P46","TATA SHORT TERM BOND - DIRECT PERIODIC DIVIDEND/BONUS REINVESTMENT",7.5,92.5]
[1008,"UTIBALANCE","INF789F01323","UTI - Hybrid Equity Fund - Regular Plan - Growth",7.5,92.5]
[1009,"UTIBALANCE","INF789F01307","UTI - Hybrid Equity Fund - Regular Plan - Dividend Payout",7.5,92.5]
[1010,"UTIBALANCE","INF789F01315","UTI - Hybrid Equity Fund - Regular Plan - Dividend Reinvestment",7.5,92.5]
[1011,"UTIDYF","INF789F01448","UTI - DIVIDEND YIELD FUND - DIVIDEND OPTION",8.5,91.5]
[1012,"UTIDYF","INF789F01463","UTI - DIVIDEND YIELD FUND - GROWTH OPTION",8.5,91.5]
[1013,"UTIDYF","INF789F01455","UTI - DIVIDEND YIELD FUND - DIVIDEND OPTION",8.5,91.5]
[1014,"UTIEQUITY","INF189A01053","UTI Flexi Cap Fund-Regular Dividend Plan",8.5,91.5]
[1015,"UTIEQUITY","INF789F01513","UTI Flexi Cap Fund- Regular Growth Plan",7.5,92.5]
[1016,"UTIEQUITY","INF789F01505","UTI Flexi Cap Fund-Regular Dividend Plan",8.5,91.5]
[1017,"UTIMIDCAP","INF789F01794","UTI - MID CAP FUND - DIVIDEND PLAN",7.5,92.5]
[1018,"UTIMIDCAP","INF789F01810","UTI - MID CAP FUND - GROWTH PLAN",7.5,92.5]
[1019,"UTIMIDCAP","INF789F01802","UTI - MID CAP FUND - DIVIDEND PLAN",7.5,92.5]
[1020,"UTIMISADV","INF789F01877","UTI - Regular Saving Fund - Flexi Dividend Plan",7.5,92.5]
[1021,"UTIMISADV","INF789F01893","UTI - Regular Saving Fund - Growth Plan",7.5,92.5]
[1022,"UTIMISADV","INF789F01885","UTI - Regular Saving Fund - Flexi Dividend Plan",7.5,92.5]
[1023,"UTIMISADVM","INF789F01901","UTI - Regular Saving Fund - Monthly Dividend Plan",7.5,92.5]
[1024,"UTIMISADVM","INF789F01919","UTI - Regular Saving Fund - Monthly Dividend Plan",7.5,92.5]
[1025,"UTIMNC","INF789F01828","UTI-MNC FUND - DIVIDEND PLAN",7.5,92.5]
[1026,"UTIMNC","INF789F01844","UTI-MNC FUND - GROWTH PLAN",7.5,92.5]
[1027,"UTIMNC","INF789F01836","UTI-MNC FUND - DIVIDEND PLAN",7.5,92.5]
[1028,"UTIMSHARE","INF189A01038","UTI-MASTERSHARE UNIT SCHEME - DIVIDEND PLAN",8.5,91.5]
[1029,"UTIMSHARE","INF789F01976","UTI-MASTERSHARE UNIT SCHEME - GROWTH PLAN",7.5,92.5]
[1030,"UTIMSHARE","INF789F01950","UTI-MASTERSHARE UNIT SCHEME - DIVIDEND PLAN",8.5,91.5]
[1031,"UTIOPRTUNE","INF789F01AE0","UTI OPPORTUNITIES FUND - DIVIDEND PLAN",8.5,91.5]
[1032,"UTIOPRTUNE","INF789F01AG5","UTI OPPORTUNITIES FUND - GROWTH PLAN",8.5,91.5]
[1033,"UTIOPRTUNE","INF789F01AF7","UTI OPPORTUNITIES FUND - DIVIDEND PLAN",8.5,91.5]
[1034,"UTISTINCME","INF789F01AJ9","UTI - SHORT TERM INCOME FUND DISCONTINUED - REGULAR PLAN - GROWTH",7.5,92.5]
[1035,"UTISTINCME","INF789F01AI1","UTI - SHORT TERM INCOME FUND DISCONTINUED - REGULAR PLAN - DIVIDEND REINVESTMENT",7.5,92.5]
[]
[]
[]
[]
[]
[]
[]
["Notes"]
["1) Haircut as applicable subject to a minimum of VaR\n"]
["2) The benefit for the above securities are subject to the Overall limit. Member-wise limit and Liquid Asset Limit as stated in the Circular Ref. No.NSE/CMPT/19572. Dated December-13-2011.\n"]
["3) For stocks pledged before 5pm, collateral margin will be available on T+1 day."]
["4) Interest of 0.05% per day on any debit balance or if cash collateral is not maintained in the ratio of 1:1 for positions held"]
["5) Cost of pledge: Rs.30 + GST per scrip irrespective of quantity of stock pledged."]
["6) For all unpledge requests placed before 2 pm, stock will be available in demat account for trading on T+1 day."]
["7) Check this link http://tradingqna.com/29334/pledge-stocks-margin-trade-will-interest-charge-calculated to know how debit balance and interest is calculated"]
["8) Available Qty for Pledge subject to change on an EOD basis."]
[]
["Disclaimer","The memberwise limit is indicative in nature. Raising a pledge request for a stock does not guarantee that the pledge will be accepted."]